PatModImg_Unex_0
[2024-08-01T02:43:30.028Z] Running test PatModImg_Unex_0 ...
[2024-08-01T02:43:30.028Z] ===============================================
[2024-08-01T02:43:30.336Z] PatModImg_Unex_0 Start Time: Thu Aug 1 02:43:30 2024 Epoch Time (ms): 1722480210061
[2024-08-01T02:43:30.648Z] variation: Mode150
[2024-08-01T02:43:30.993Z] JVM_OPTIONS: -XX:+UseCompressedOops
[2024-08-01T02:43:30.993Z] { \
[2024-08-01T02:43:30.993Z] echo ""; echo "TEST SETUP:"; \
[2024-08-01T02:43:30.993Z] echo "Nothing to be done for setup."; \
[2024-08-01T02:43:30.993Z] mkdir -p "C:/jenkins/workspace/Test_openjdk17_hs_sanity.system_x86-64_windows_testList_1/aqa-tests/\\TKG\\output_17224779936909\\PatModImg_Unex_0"; \
[2024-08-01T02:43:30.993Z] cd "C:/jenkins/workspace/Test_openjdk17_hs_sanity.system_x86-64_windows_testList_1/aqa-tests/\\TKG\\output_17224779936909\\PatModImg_Unex_0"; \
[2024-08-01T02:43:30.993Z] echo ""; echo "TESTING:"; \
[2024-08-01T02:43:30.994Z] perl C:/jenkins/workspace/Test_openjdk17_hs_sanity.system_x86-64_windows_testList_1/aqa-tests///..//jvmtest\\system\\modularity/../\\STF\\stf.core\\scripts\\stf.pl -test-root="C:/jenkins/workspace/Test_openjdk17_hs_sanity.system_x86-64_windows_testList_1/aqa-tests///..//jvmtest\\system\\modularity/../\\STF;C:/jenkins/workspace/Test_openjdk17_hs_sanity.system_x86-64_windows_testList_1/aqa-tests///..//jvmtest\\system\\modularity/../\\aqa-systemtest""" -systemtest-prereqs="c:/jenkins/workspace/Test_openjdk17_hs_sanity.system_x86-64_windows_testList_1/../../testDependency/system_lib\\" -java-args=' -XX:+UseCompressedOops ' -results-root="C:/jenkins/workspace/Test_openjdk17_hs_sanity.system_x86-64_windows_testList_1/aqa-tests/\\TKG\\output_17224779936909\\PatModImg_Unex_0" -test=PatModImgTest -test-args="variant=Unex"; \
[2024-08-01T02:43:30.994Z] if [ $? -eq 0 ]; then echo "-----------------------------------"; echo "PatModImg_Unex_0""_PASSED"; echo "-----------------------------------"; cd C:/jenkins/workspace/Test_openjdk17_hs_sanity.system_x86-64_windows_testList_1/aqa-tests/; rm -f -r "C:/jenkins/workspace/Test_openjdk17_hs_sanity.system_x86-64_windows_testList_1/aqa-tests/\\TKG\\output_17224779936909\\PatModImg_Unex_0"; else echo "-----------------------------------"; echo "PatModImg_Unex_0""_FAILED"; echo "-----------------------------------"; fi; \
[2024-08-01T02:43:30.994Z] echo ""; echo "TEST TEARDOWN:"; \
[2024-08-01T02:43:30.994Z] echo "Nothing to be done for teardown."; \
[2024-08-01T02:43:30.994Z] } 2>&1 | tee -a "C:/jenkins/workspace/Test_openjdk17_hs_sanity.system_x86-64_windows_testList_1/aqa-tests/\\TKG\\output_17224779936909\\TestTargetResult";
[2024-08-01T02:43:30.994Z]
[2024-08-01T02:43:30.994Z] TEST SETUP:
[2024-08-01T02:43:30.994Z] Nothing to be done for setup.
[2024-08-01T02:43:30.994Z]
[2024-08-01T02:43:30.994Z] TESTING:
[2024-08-01T02:43:31.317Z] STF 02:43:30.982 - ========================= S T F =========================
[2024-08-01T02:43:31.317Z] systemtest-prereqs has been processed, and set to: c:/jenkins/testDependency/system_libRetrieving amount of free space on drive containing C:/jenkins/workspace/Test_openjdk17_hs_sanity.system_x86-64_windows_testList_1/aqa-tests/\TKG\output_17224779936909\PatModImg_Unex_0
[2024-08-01T02:43:31.317Z] There is 95240 Mb free
[2024-08-01T02:43:31.317Z] STF 02:43:31.028 - ================== G E N E R A T I O N ==================
[2024-08-01T02:43:31.317Z] STF 02:43:31.030 - Checking JVM: c:/jenkins/workspace/Test_openjdk17_hs_sanity.system_x86-64_windows_testList_1/jdkbinary/j2sdk-image
[2024-08-01T02:43:31.317Z] STF 02:43:31.030 - Starting process to generate scripts: c:/jenkins/workspace/Test_openjdk17_hs_sanity.system_x86-64_windows_testList_1/jdkbinary/j2sdk-image/bin/java -Dlog4j.skipJansi=true -Djava.system.class.loader=net.adoptopenjdk.stf.runner.StfClassLoader -classpath c:/jenkins/workspace/Test_openjdk17_hs_sanity.system_x86-64_windows_testList_1/../../testDependency/system_lib\/log4j/log4j-api.jar;c:/jenkins/workspace/Test_openjdk17_hs_sanity.system_x86-64_windows_testList_1/../../testDependency/system_lib\/log4j/log4j-core.jar;C:/jenkins/workspace/Test_openjdk17_hs_sanity.system_x86-64_windows_testList_1/jvmtest/system/STF/stf.core/scripts/../bin net.adoptopenjdk.stf.runner.StfRunner -properties "C:/jenkins/workspace/Test_openjdk17_hs_sanity.system_x86-64_windows_testList_1/aqa-tests/\TKG\output_17224779936909\PatModImg_Unex_0/20240801-024330-PatModImgTest/stf_parameters.properties, , C:/jenkins/workspace/Test_openjdk17_hs_sanity.system_x86-64_windows_testList_1/jvmtest/system/STF/stf.core/config/stf.properties" -testDir "C:/jenkins/workspace/Test_openjdk17_hs_sanity.system_x86-64_windows_testList_1/aqa-tests/\TKG\output_17224779936909\PatModImg_Unex_0/20240801-024330-PatModImgTest"
[2024-08-01T02:43:31.317Z] GEN stderr OpenJDK 64-Bit Server VM warning: Archived non-system classes are disabled because the java.system.class.loader property is specified (value = "net.adoptopenjdk.stf.runner.StfClassLoader"). To use archived non-system classes, this property must not be set
[2024-08-01T02:43:31.999Z] GEN 02:43:31.831 - Found test. Project: 'openjdk.test.modularity' class: 'PatModImgTest.class' Dir: 'C:\jenkins\workspace\Test_openjdk17_hs_sanity.system_x86-64_windows_testList_1\jvmtest\system\aqa-systemtest\openjdk.test.modularity\bin'
[2024-08-01T02:43:31.999Z] GEN 02:43:31.847 - Found test. Project: 'openjdk.test.modularity' class: 'net.adoptopenjdk.test.modularity.PatModImgTest'
[2024-08-01T02:43:32.319Z] GEN Classpath directories used by project 'openjdk.test.modularity':
[2024-08-01T02:43:32.319Z] GEN C:\jenkins\workspace\Test_openjdk17_hs_sanity.system_x86-64_windows_testList_1\jvmtest\system\aqa-systemtest\openjdk.test.modularity\bin\common-mods\displayService
[2024-08-01T02:43:32.319Z] GEN C:\jenkins\workspace\Test_openjdk17_hs_sanity.system_x86-64_windows_testList_1\jvmtest\system\aqa-systemtest\openjdk.test.modularity\bin\common-mods\com.helper
[2024-08-01T02:43:32.319Z] GEN C:\jenkins\workspace\Test_openjdk17_hs_sanity.system_x86-64_windows_testList_1\jvmtest\system\aqa-systemtest\openjdk.test.modularity\bin\common-mods\displayServiceImpl1
[2024-08-01T02:43:32.319Z] GEN C:\jenkins\workspace\Test_openjdk17_hs_sanity.system_x86-64_windows_testList_1\jvmtest\system\aqa-systemtest\openjdk.test.modularity\bin\common-mods\com.discreet
[2024-08-01T02:43:32.319Z] GEN C:\jenkins\workspace\Test_openjdk17_hs_sanity.system_x86-64_windows_testList_1\jvmtest\system\aqa-systemtest\openjdk.test.modularity\bin\common-mods\com.hello
[2024-08-01T02:43:32.319Z] GEN C:\jenkins\workspace\Test_openjdk17_hs_sanity.system_x86-64_windows_testList_1\jvmtest\system\aqa-systemtest\openjdk.test.modularity\bin\common-mods\com.hola
[2024-08-01T02:43:32.319Z] GEN C:\jenkins\workspace\Test_openjdk17_hs_sanity.system_x86-64_windows_testList_1\jvmtest\system\aqa-systemtest\openjdk.test.modularity\bin\common-mods\displayServiceImpl2
[2024-08-01T02:43:32.319Z] GEN C:\jenkins\workspace\Test_openjdk17_hs_sanity.system_x86-64_windows_testList_1\jvmtest\system\aqa-systemtest\openjdk.test.modularity\bin\common-mods\com.hi
[2024-08-01T02:43:32.319Z] GEN C:\jenkins\workspace\Test_openjdk17_hs_sanity.system_x86-64_windows_testList_1\jvmtest\system\aqa-systemtest\openjdk.test.modularity\bin\common-override
[2024-08-01T02:43:32.319Z] GEN C:\jenkins\workspace\Test_openjdk17_hs_sanity.system_x86-64_windows_testList_1\jvmtest\system\aqa-systemtest\openjdk.test.modularity\bin\common-override-new
[2024-08-01T02:43:32.319Z] GEN C:\jenkins\workspace\Test_openjdk17_hs_sanity.system_x86-64_windows_testList_1\jvmtest\system\aqa-systemtest\openjdk.test.modularity\bin\common\displayServiceImpl3
[2024-08-01T02:43:32.319Z] GEN C:\jenkins\workspace\Test_openjdk17_hs_sanity.system_x86-64_windows_testList_1\jvmtest\system\aqa-systemtest\openjdk.test.modularity\bin\common\displayServiceImpl4
[2024-08-01T02:43:32.319Z] GEN C:\jenkins\workspace\Test_openjdk17_hs_sanity.system_x86-64_windows_testList_1\jvmtest\system\aqa-systemtest\openjdk.test.modularity\bin\common
[2024-08-01T02:43:32.319Z] GEN C:\jenkins\workspace\Test_openjdk17_hs_sanity.system_x86-64_windows_testList_1\jvmtest\system\aqa-systemtest\openjdk.test.modularity\bin\tests
[2024-08-01T02:43:32.319Z] GEN C:\\jenkins\\workspace\\Test_openjdk17_hs_sanity.system_x86-64_windows_testList_1\\jvmtest\\system\\aqa-systemtest\\openjdk.test.modularity\\bin
[2024-08-01T02:43:32.319Z] GEN C:\\jenkins\\workspace\\Test_openjdk17_hs_sanity.system_x86-64_windows_testList_1\\jvmtest\\system\\STF\\stf.core\\bin
[2024-08-01T02:43:32.319Z] GEN c:/jenkins/testDependency/system_lib/log4j/log4j-api.jar
[2024-08-01T02:43:32.319Z] GEN c:/jenkins/testDependency/system_lib/log4j/log4j-core.jar
[2024-08-01T02:43:32.319Z] GEN c:/jenkins/testDependency/system_lib/junit/junit.jar
[2024-08-01T02:43:32.319Z] GEN 02:43:32.058 - Using Mode NoOptions. Values = ''
[2024-08-01T02:43:32.319Z] GEN 02:43:32.141 -
[2024-08-01T02:43:32.319Z] GEN 02:43:32.141 - Test command summary:
[2024-08-01T02:43:32.319Z] GEN 02:43:32.141 - Step Stage Command Description
[2024-08-01T02:43:32.319Z] GEN 02:43:32.142 - -----+--------+-----------------+------------
[2024-08-01T02:43:32.319Z] GEN 02:43:32.142 - 1 execute jar Create com.hello jar
[2024-08-01T02:43:32.319Z] GEN 02:43:32.142 - 2 execute jar Create com.hola jar
[2024-08-01T02:43:32.319Z] GEN 02:43:32.142 - 3 execute jar Create com.helper jar
[2024-08-01T02:43:32.319Z] GEN 02:43:32.142 - 4 execute jar Create com.discreet jar
[2024-08-01T02:43:32.319Z] GEN 02:43:32.142 - 5 execute jar Create tests jar
[2024-08-01T02:43:32.319Z] GEN 02:43:32.142 - 6 execute jlink Create runtime image for PatchModule test
[2024-08-01T02:43:32.319Z] GEN 02:43:32.142 - 7 execute jar Create com.hello jar
[2024-08-01T02:43:32.319Z] GEN 02:43:32.142 - 8 execute jar create java.xml.jar
[2024-08-01T02:43:32.319Z] GEN 02:43:32.142 - 9 execute Run java (Negative test) Include a new package that is not exported and check if the public type cannot be accessed
[2024-08-01T02:43:32.319Z] GEN 02:43:32.142 - 10 execute count Check output
[2024-08-01T02:43:32.319Z] GEN 02:43:32.142 - 11 execute Run java Include a new package that is not exported and check if the public type can be accessed by adding --add-exports
[2024-08-01T02:43:32.319Z] STF 02:43:32.169 -
[2024-08-01T02:43:32.319Z] STF 02:43:32.169 - Script generation completed
[2024-08-01T02:43:32.319Z] STF 02:43:32.169 -
[2024-08-01T02:43:32.319Z] STF 02:43:32.171 -
[2024-08-01T02:43:32.319Z] STF 02:43:32.171 - ======================= S E T U P =======================
[2024-08-01T02:43:32.320Z] STF 02:43:32.171 - Running setup: perl C:/jenkins/workspace/Test_openjdk17_hs_sanity.system_x86-64_windows_testList_1/aqa-tests/\TKG\output_17224779936909\PatModImg_Unex_0/20240801-024330-PatModImgTest/setUp.pl
[2024-08-01T02:43:32.645Z] STF 02:43:32.295 - SETUP stage completed
[2024-08-01T02:43:32.645Z] STF 02:43:32.310 -
[2024-08-01T02:43:32.645Z] STF 02:43:32.310 - ==================== E X E C U T E - ====================
[2024-08-01T02:43:32.645Z] STF 02:43:32.310 - Running execute: perl C:/jenkins/workspace/Test_openjdk17_hs_sanity.system_x86-64_windows_testList_1/aqa-tests/\TKG\output_17224779936909\PatModImg_Unex_0/20240801-024330-PatModImgTest/execute.pl
[2024-08-01T02:43:32.645Z] STF 02:43:32.451 -
[2024-08-01T02:43:32.645Z] STF 02:43:32.451 - Java version
[2024-08-01T02:43:32.645Z] STF 02:43:32.451 - Running: c:/jenkins/workspace/Test_openjdk17_hs_sanity.system_x86-64_windows_testList_1/jdkbinary/j2sdk-image/bin/java -version
[2024-08-01T02:43:32.645Z] openjdk version "17.0.13-beta" 2024-10-15
[2024-08-01T02:43:32.645Z] OpenJDK Runtime Environment Temurin-17.0.13+1-202407312053 (build 17.0.13-beta+1-ea)
[2024-08-01T02:43:32.645Z] OpenJDK 64-Bit Server VM Temurin-17.0.13+1-202407312053 (build 17.0.13-beta+1-ea, mixed mode, sharing)
[2024-08-01T02:43:32.645Z] STF 02:43:32.540 -
[2024-08-01T02:43:32.645Z] STF 02:43:32.540 - +------ Step 1 - Create com.hello jar
[2024-08-01T02:43:32.645Z] STF 02:43:32.540 - | Create modular jar
[2024-08-01T02:43:32.645Z] STF 02:43:32.540 - | ModuleSpec: openjdk.test.modularity/bin/common-mods/com.hello
[2024-08-01T02:43:32.645Z] STF 02:43:32.540 - | ModuleVersion: null
[2024-08-01T02:43:32.645Z] STF 02:43:32.540 - | MainClass: null
[2024-08-01T02:43:32.645Z] STF 02:43:32.540 - | HashModules: null
[2024-08-01T02:43:32.645Z] STF 02:43:32.540 - |
[2024-08-01T02:43:32.645Z] STF 02:43:32.540 - Running command: c:/jenkins/workspace/Test_openjdk17_hs_sanity.system_x86-64_windows_testList_1/jdkbinary/j2sdk-image/bin/jar --create --file C:/jenkins/workspace/Test_openjdk17_hs_sanity.system_x86-64_windows_testList_1/aqa-tests/TKG/output_17224779936909/PatModImg_Unex_0/20240801-024330-PatModImgTest/modules/1.com.hello.jar -C C:\jenkins\workspace\Test_openjdk17_hs_sanity.system_x86-64_windows_testList_1\jvmtest\system\aqa-systemtest\openjdk.test.modularity\bin\common-mods\com.hello .
[2024-08-01T02:43:32.645Z] STF 02:43:32.541 - Redirecting stderr to C:/jenkins/workspace/Test_openjdk17_hs_sanity.system_x86-64_windows_testList_1/aqa-tests/TKG/output_17224779936909/PatModImg_Unex_0/20240801-024330-PatModImgTest/results/1.CMJ.stderr
[2024-08-01T02:43:32.645Z] STF 02:43:32.541 - Redirecting stdout to C:/jenkins/workspace/Test_openjdk17_hs_sanity.system_x86-64_windows_testList_1/aqa-tests/TKG/output_17224779936909/PatModImg_Unex_0/20240801-024330-PatModImgTest/results/1.CMJ.stdout
[2024-08-01T02:43:32.646Z] STF 02:43:32.566 - Monitoring processes: CMJ
[2024-08-01T02:43:32.967Z] STF 02:43:32.807 - Monitoring Report Summary:
[2024-08-01T02:43:32.967Z] STF 02:43:32.808 - o Process CMJ ended with the expected exit code (0)
[2024-08-01T02:43:32.968Z] STF 02:43:32.808 - Created modular jar: 1.com.hello.jar
[2024-08-01T02:43:32.968Z] STF 02:43:32.808 -
[2024-08-01T02:43:32.968Z] STF 02:43:32.808 - +------ Step 2 - Create com.hola jar
[2024-08-01T02:43:32.968Z] STF 02:43:32.808 - | Create modular jar
[2024-08-01T02:43:32.968Z] STF 02:43:32.808 - | ModuleSpec: openjdk.test.modularity/bin/common-mods/com.hola
[2024-08-01T02:43:32.968Z] STF 02:43:32.808 - | ModuleVersion: null
[2024-08-01T02:43:32.968Z] STF 02:43:32.808 - | MainClass: null
[2024-08-01T02:43:32.968Z] STF 02:43:32.808 - | HashModules: null
[2024-08-01T02:43:32.968Z] STF 02:43:32.808 - |
[2024-08-01T02:43:32.968Z] STF 02:43:32.808 - Running command: c:/jenkins/workspace/Test_openjdk17_hs_sanity.system_x86-64_windows_testList_1/jdkbinary/j2sdk-image/bin/jar --create --file C:/jenkins/workspace/Test_openjdk17_hs_sanity.system_x86-64_windows_testList_1/aqa-tests/TKG/output_17224779936909/PatModImg_Unex_0/20240801-024330-PatModImgTest/modules/2.com.hola.jar -C C:\jenkins\workspace\Test_openjdk17_hs_sanity.system_x86-64_windows_testList_1\jvmtest\system\aqa-systemtest\openjdk.test.modularity\bin\common-mods\com.hola .
[2024-08-01T02:43:32.968Z] STF 02:43:32.808 - Redirecting stderr to C:/jenkins/workspace/Test_openjdk17_hs_sanity.system_x86-64_windows_testList_1/aqa-tests/TKG/output_17224779936909/PatModImg_Unex_0/20240801-024330-PatModImgTest/results/2.CMJ.stderr
[2024-08-01T02:43:32.968Z] STF 02:43:32.808 - Redirecting stdout to C:/jenkins/workspace/Test_openjdk17_hs_sanity.system_x86-64_windows_testList_1/aqa-tests/TKG/output_17224779936909/PatModImg_Unex_0/20240801-024330-PatModImgTest/results/2.CMJ.stdout
[2024-08-01T02:43:32.968Z] STF 02:43:32.814 - Monitoring processes: CMJ
[2024-08-01T02:43:33.278Z] STF 02:43:33.059 - Monitoring Report Summary:
[2024-08-01T02:43:33.278Z] STF 02:43:33.059 - o Process CMJ ended with the expected exit code (0)
[2024-08-01T02:43:33.278Z] STF 02:43:33.059 - Created modular jar: 2.com.hola.jar
[2024-08-01T02:43:33.278Z] STF 02:43:33.059 -
[2024-08-01T02:43:33.278Z] STF 02:43:33.059 - +------ Step 3 - Create com.helper jar
[2024-08-01T02:43:33.278Z] STF 02:43:33.059 - | Create modular jar
[2024-08-01T02:43:33.278Z] STF 02:43:33.059 - | ModuleSpec: openjdk.test.modularity/bin/common-mods/com.helper
[2024-08-01T02:43:33.278Z] STF 02:43:33.059 - | ModuleVersion: null
[2024-08-01T02:43:33.278Z] STF 02:43:33.059 - | MainClass: null
[2024-08-01T02:43:33.278Z] STF 02:43:33.059 - | HashModules: null
[2024-08-01T02:43:33.278Z] STF 02:43:33.059 - |
[2024-08-01T02:43:33.279Z] STF 02:43:33.060 - Running command: c:/jenkins/workspace/Test_openjdk17_hs_sanity.system_x86-64_windows_testList_1/jdkbinary/j2sdk-image/bin/jar --create --file C:/jenkins/workspace/Test_openjdk17_hs_sanity.system_x86-64_windows_testList_1/aqa-tests/TKG/output_17224779936909/PatModImg_Unex_0/20240801-024330-PatModImgTest/modules/3.com.helper.jar -C C:\jenkins\workspace\Test_openjdk17_hs_sanity.system_x86-64_windows_testList_1\jvmtest\system\aqa-systemtest\openjdk.test.modularity\bin\common-mods\com.helper .
[2024-08-01T02:43:33.279Z] STF 02:43:33.060 - Redirecting stderr to C:/jenkins/workspace/Test_openjdk17_hs_sanity.system_x86-64_windows_testList_1/aqa-tests/TKG/output_17224779936909/PatModImg_Unex_0/20240801-024330-PatModImgTest/results/3.CMJ.stderr
[2024-08-01T02:43:33.279Z] STF 02:43:33.060 - Redirecting stdout to C:/jenkins/workspace/Test_openjdk17_hs_sanity.system_x86-64_windows_testList_1/aqa-tests/TKG/output_17224779936909/PatModImg_Unex_0/20240801-024330-PatModImgTest/results/3.CMJ.stdout
[2024-08-01T02:43:33.279Z] STF 02:43:33.066 - Monitoring processes: CMJ
[2024-08-01T02:43:33.598Z] STF 02:43:33.317 - Monitoring Report Summary:
[2024-08-01T02:43:33.598Z] STF 02:43:33.317 - o Process CMJ ended with the expected exit code (0)
[2024-08-01T02:43:33.598Z] STF 02:43:33.317 - Created modular jar: 3.com.helper.jar
[2024-08-01T02:43:33.598Z] STF 02:43:33.317 -
[2024-08-01T02:43:33.598Z] STF 02:43:33.317 - +------ Step 4 - Create com.discreet jar
[2024-08-01T02:43:33.598Z] STF 02:43:33.317 - | Create modular jar
[2024-08-01T02:43:33.598Z] STF 02:43:33.317 - | ModuleSpec: openjdk.test.modularity/bin/common-mods/com.discreet
[2024-08-01T02:43:33.598Z] STF 02:43:33.317 - | ModuleVersion: null
[2024-08-01T02:43:33.598Z] STF 02:43:33.317 - | MainClass: null
[2024-08-01T02:43:33.598Z] STF 02:43:33.317 - | HashModules: null
[2024-08-01T02:43:33.598Z] STF 02:43:33.317 - |
[2024-08-01T02:43:33.598Z] STF 02:43:33.317 - Running command: c:/jenkins/workspace/Test_openjdk17_hs_sanity.system_x86-64_windows_testList_1/jdkbinary/j2sdk-image/bin/jar --create --file C:/jenkins/workspace/Test_openjdk17_hs_sanity.system_x86-64_windows_testList_1/aqa-tests/TKG/output_17224779936909/PatModImg_Unex_0/20240801-024330-PatModImgTest/modules/4.com.discreet.jar -C C:\jenkins\workspace\Test_openjdk17_hs_sanity.system_x86-64_windows_testList_1\jvmtest\system\aqa-systemtest\openjdk.test.modularity\bin\common-mods\com.discreet .
[2024-08-01T02:43:33.598Z] STF 02:43:33.317 - Redirecting stderr to C:/jenkins/workspace/Test_openjdk17_hs_sanity.system_x86-64_windows_testList_1/aqa-tests/TKG/output_17224779936909/PatModImg_Unex_0/20240801-024330-PatModImgTest/results/4.CMJ.stderr
[2024-08-01T02:43:33.598Z] STF 02:43:33.317 - Redirecting stdout to C:/jenkins/workspace/Test_openjdk17_hs_sanity.system_x86-64_windows_testList_1/aqa-tests/TKG/output_17224779936909/PatModImg_Unex_0/20240801-024330-PatModImgTest/results/4.CMJ.stdout
[2024-08-01T02:43:33.598Z] STF 02:43:33.323 - Monitoring processes: CMJ
[2024-08-01T02:43:33.921Z] STF 02:43:33.566 - Monitoring Report Summary:
[2024-08-01T02:43:33.921Z] STF 02:43:33.566 - o Process CMJ ended with the expected exit code (0)
[2024-08-01T02:43:33.921Z] STF 02:43:33.566 - Created modular jar: 4.com.discreet.jar
[2024-08-01T02:43:33.921Z] STF 02:43:33.566 -
[2024-08-01T02:43:33.921Z] STF 02:43:33.566 - +------ Step 5 - Create tests jar
[2024-08-01T02:43:33.921Z] STF 02:43:33.566 - | Create modular jar
[2024-08-01T02:43:33.921Z] STF 02:43:33.566 - | ModuleSpec: openjdk.test.modularity/bin/tests/com.test
[2024-08-01T02:43:33.921Z] STF 02:43:33.566 - | ModuleVersion: null
[2024-08-01T02:43:33.921Z] STF 02:43:33.566 - | MainClass: null
[2024-08-01T02:43:33.921Z] STF 02:43:33.566 - | HashModules: null
[2024-08-01T02:43:33.921Z] STF 02:43:33.566 - |
[2024-08-01T02:43:33.921Z] STF 02:43:33.567 - Running command: c:/jenkins/workspace/Test_openjdk17_hs_sanity.system_x86-64_windows_testList_1/jdkbinary/j2sdk-image/bin/jar --create --file C:/jenkins/workspace/Test_openjdk17_hs_sanity.system_x86-64_windows_testList_1/aqa-tests/TKG/output_17224779936909/PatModImg_Unex_0/20240801-024330-PatModImgTest/modules/5.com.test.jar -C C:\jenkins\workspace\Test_openjdk17_hs_sanity.system_x86-64_windows_testList_1\jvmtest\system\aqa-systemtest\openjdk.test.modularity\bin\tests\com.test .
[2024-08-01T02:43:33.921Z] STF 02:43:33.567 - Redirecting stderr to C:/jenkins/workspace/Test_openjdk17_hs_sanity.system_x86-64_windows_testList_1/aqa-tests/TKG/output_17224779936909/PatModImg_Unex_0/20240801-024330-PatModImgTest/results/5.CMJ.stderr
[2024-08-01T02:43:33.921Z] STF 02:43:33.567 - Redirecting stdout to C:/jenkins/workspace/Test_openjdk17_hs_sanity.system_x86-64_windows_testList_1/aqa-tests/TKG/output_17224779936909/PatModImg_Unex_0/20240801-024330-PatModImgTest/results/5.CMJ.stdout
[2024-08-01T02:43:33.921Z] STF 02:43:33.572 - Monitoring processes: CMJ
[2024-08-01T02:43:33.921Z] STF 02:43:33.831 - Monitoring Report Summary:
[2024-08-01T02:43:33.921Z] STF 02:43:33.831 - o Process CMJ ended with the expected exit code (0)
[2024-08-01T02:43:33.921Z] STF 02:43:33.831 - Created modular jar: 5.com.test.jar
[2024-08-01T02:43:33.921Z] STF 02:43:33.831 -
[2024-08-01T02:43:33.921Z] STF 02:43:33.832 - +------ Step 6 - Create runtime image for PatchModule test
[2024-08-01T02:43:33.921Z] STF 02:43:33.832 - | Run jlink to create runtime image
[2024-08-01T02:43:33.921Z] STF 02:43:33.832 - | ImageName: XpJVM
[2024-08-01T02:43:33.921Z] STF 02:43:33.832 - |
[2024-08-01T02:43:33.922Z] STF 02:43:33.832 - Running command: c:/jenkins/workspace/Test_openjdk17_hs_sanity.system_x86-64_windows_testList_1/jdkbinary/j2sdk-image/bin/jlink --module-path c:\jenkins\workspace\Test_openjdk17_hs_sanity.system_x86-64_windows_testList_1\jdkbinary\j2sdk-image\jmods;C:\jenkins\workspace\Test_openjdk17_hs_sanity.system_x86-64_windows_testList_1\aqa-tests\TKG\output_17224779936909\PatModImg_Unex_0\20240801-024330-PatModImgTest\modules --add-modules com.hello,com.hola,com.test,com.helper,com.discreet --output C:\jenkins\workspace\Test_openjdk17_hs_sanity.system_x86-64_windows_testList_1\aqa-tests\TKG\output_17224779936909\PatModImg_Unex_0\20240801-024330-PatModImgTest\tmp\6.XpJVM
[2024-08-01T02:43:33.922Z] STF 02:43:33.832 - Redirecting stderr to C:/jenkins/workspace/Test_openjdk17_hs_sanity.system_x86-64_windows_testList_1/aqa-tests/TKG/output_17224779936909/PatModImg_Unex_0/20240801-024330-PatModImgTest/results/6.JLNK.stderr
[2024-08-01T02:43:33.922Z] STF 02:43:33.832 - Redirecting stdout to C:/jenkins/workspace/Test_openjdk17_hs_sanity.system_x86-64_windows_testList_1/aqa-tests/TKG/output_17224779936909/PatModImg_Unex_0/20240801-024330-PatModImgTest/results/6.JLNK.stdout
[2024-08-01T02:43:33.922Z] STF 02:43:33.837 - Monitoring processes: JLNK
[2024-08-01T02:43:36.135Z] STF 02:43:35.885 - Monitoring Report Summary:
[2024-08-01T02:43:36.135Z] STF 02:43:35.885 - o Process JLNK ended with the expected exit code (0)
[2024-08-01T02:43:36.135Z] STF 02:43:35.885 -
[2024-08-01T02:43:36.135Z] STF 02:43:35.885 - +------ Step 7 - Create com.hello jar
[2024-08-01T02:43:36.135Z] STF 02:43:35.885 - | Create modular jar
[2024-08-01T02:43:36.135Z] STF 02:43:35.885 - | ModuleSpec: openjdk.test.modularity/bin/common-override/com.hello
[2024-08-01T02:43:36.135Z] STF 02:43:35.885 - | ModuleVersion: null
[2024-08-01T02:43:36.135Z] STF 02:43:35.885 - | MainClass: null
[2024-08-01T02:43:36.135Z] STF 02:43:35.885 - | HashModules: null
[2024-08-01T02:43:36.135Z] STF 02:43:35.885 - |
[2024-08-01T02:43:36.136Z] STF 02:43:35.886 - Running command: c:/jenkins/workspace/Test_openjdk17_hs_sanity.system_x86-64_windows_testList_1/jdkbinary/j2sdk-image/bin/jar --create --file C:/jenkins/workspace/Test_openjdk17_hs_sanity.system_x86-64_windows_testList_1/aqa-tests/TKG/output_17224779936909/PatModImg_Unex_0/20240801-024330-PatModImgTest/modules/7.com.hello.jar -C C:\jenkins\workspace\Test_openjdk17_hs_sanity.system_x86-64_windows_testList_1\jvmtest\system\aqa-systemtest\openjdk.test.modularity\bin\common-override\com.hello .
[2024-08-01T02:43:36.136Z] STF 02:43:35.886 - Redirecting stderr to C:/jenkins/workspace/Test_openjdk17_hs_sanity.system_x86-64_windows_testList_1/aqa-tests/TKG/output_17224779936909/PatModImg_Unex_0/20240801-024330-PatModImgTest/results/7.CMJ.stderr
[2024-08-01T02:43:36.136Z] STF 02:43:35.886 - Redirecting stdout to C:/jenkins/workspace/Test_openjdk17_hs_sanity.system_x86-64_windows_testList_1/aqa-tests/TKG/output_17224779936909/PatModImg_Unex_0/20240801-024330-PatModImgTest/results/7.CMJ.stdout
[2024-08-01T02:43:36.136Z] STF 02:43:35.894 - Monitoring processes: CMJ
[2024-08-01T02:43:36.457Z] STF 02:43:36.248 - Monitoring Report Summary:
[2024-08-01T02:43:36.457Z] STF 02:43:36.248 - o Process CMJ ended with the expected exit code (0)
[2024-08-01T02:43:36.457Z] STF 02:43:36.248 - Created modular jar: 7.com.hello.jar
[2024-08-01T02:43:36.457Z] STF 02:43:36.248 -
[2024-08-01T02:43:36.457Z] STF 02:43:36.248 - +------ Step 8 - create java.xml.jar
[2024-08-01T02:43:36.457Z] STF 02:43:36.248 - | Create modular jar
[2024-08-01T02:43:36.457Z] STF 02:43:36.248 - | ModuleSpec: openjdk.test.modularity/bin/common-override/java.xml
[2024-08-01T02:43:36.457Z] STF 02:43:36.248 - | ModuleVersion: null
[2024-08-01T02:43:36.457Z] STF 02:43:36.248 - | MainClass: null
[2024-08-01T02:43:36.457Z] STF 02:43:36.248 - | HashModules: null
[2024-08-01T02:43:36.457Z] STF 02:43:36.248 - |
[2024-08-01T02:43:36.457Z] STF 02:43:36.248 - Running command: c:/jenkins/workspace/Test_openjdk17_hs_sanity.system_x86-64_windows_testList_1/jdkbinary/j2sdk-image/bin/jar --create --file C:/jenkins/workspace/Test_openjdk17_hs_sanity.system_x86-64_windows_testList_1/aqa-tests/TKG/output_17224779936909/PatModImg_Unex_0/20240801-024330-PatModImgTest/modules/8.java.xml.jar -C C:\jenkins\workspace\Test_openjdk17_hs_sanity.system_x86-64_windows_testList_1\jvmtest\system\aqa-systemtest\openjdk.test.modularity\bin\common-override\java.xml .
[2024-08-01T02:43:36.457Z] STF 02:43:36.248 - Redirecting stderr to C:/jenkins/workspace/Test_openjdk17_hs_sanity.system_x86-64_windows_testList_1/aqa-tests/TKG/output_17224779936909/PatModImg_Unex_0/20240801-024330-PatModImgTest/results/8.CMJ.stderr
[2024-08-01T02:43:36.457Z] STF 02:43:36.248 - Redirecting stdout to C:/jenkins/workspace/Test_openjdk17_hs_sanity.system_x86-64_windows_testList_1/aqa-tests/TKG/output_17224779936909/PatModImg_Unex_0/20240801-024330-PatModImgTest/results/8.CMJ.stdout
[2024-08-01T02:43:36.458Z] STF 02:43:36.254 - Monitoring processes: CMJ
[2024-08-01T02:43:36.779Z] STF 02:43:36.498 - Monitoring Report Summary:
[2024-08-01T02:43:36.780Z] STF 02:43:36.498 - o Process CMJ ended with the expected exit code (0)
[2024-08-01T02:43:36.780Z] STF 02:43:36.498 - Created modular jar: 8.java.xml.jar
[2024-08-01T02:43:36.780Z] STF 02:43:36.498 -
[2024-08-01T02:43:36.780Z] STF 02:43:36.498 - +------ Step 9 - (Negative test) Include a new package that is not exported and check if the public type cannot be accessed
[2024-08-01T02:43:36.780Z] STF 02:43:36.498 - | Run foreground process
[2024-08-01T02:43:36.780Z] STF 02:43:36.498 - | Program: C:/jenkins/workspace/Test_openjdk17_hs_sanity.system_x86-64_windows_testList_1/aqa-tests/TKG/output_17224779936909/PatModImg_Unex_0/20240801-024330-PatModImgTest/tmp/6.XpJVM/bin/java
[2024-08-01T02:43:36.780Z] STF 02:43:36.498 - | Mnemonic: OT3
[2024-08-01T02:43:36.780Z] STF 02:43:36.498 - | Echo: ECHO_ON
[2024-08-01T02:43:36.780Z] STF 02:43:36.498 - | Expectation: NON_ZERO_EXIT [1] within 5m
[2024-08-01T02:43:36.780Z] STF 02:43:36.498 - |
[2024-08-01T02:43:36.780Z] STF 02:43:36.499 - Running command: C:/jenkins/workspace/Test_openjdk17_hs_sanity.system_x86-64_windows_testList_1/aqa-tests/TKG/output_17224779936909/PatModImg_Unex_0/20240801-024330-PatModImgTest/tmp/6.XpJVM/bin/java --add-reads com.test=ALL-UNNAMED --patch-module com.hello=C:/jenkins/workspace/Test_openjdk17_hs_sanity.system_x86-64_windows_testList_1/aqa-tests/TKG/output_17224779936909/PatModImg_Unex_0/20240801-024330-PatModImgTest/modules/7.com.hello.jar -XX:+UseCompressedOops -classpath c:/jenkins/testDependency/system_lib/junit/junit.jar;c:/jenkins/testDependency/system_lib/junit/hamcrest-core.jar org.junit.runner.JUnitCore net.adoptopenjdk.test.modularity.junit.TestOverrideUsingAppModuleAndNewPackage
[2024-08-01T02:43:36.780Z] STF 02:43:36.499 - Redirecting stderr to C:/jenkins/workspace/Test_openjdk17_hs_sanity.system_x86-64_windows_testList_1/aqa-tests/TKG/output_17224779936909/PatModImg_Unex_0/20240801-024330-PatModImgTest/results/9.OT3.stderr
[2024-08-01T02:43:36.780Z] STF 02:43:36.499 - Redirecting stdout to C:/jenkins/workspace/Test_openjdk17_hs_sanity.system_x86-64_windows_testList_1/aqa-tests/TKG/output_17224779936909/PatModImg_Unex_0/20240801-024330-PatModImgTest/results/9.OT3.stdout
[2024-08-01T02:43:36.780Z] STF 02:43:36.536 - Monitoring processes: OT3
[2024-08-01T02:43:36.780Z] OT3 stderr WARNING: module-info.class ignored in patch: C:\jenkins\workspace\Test_openjdk17_hs_sanity.system_x86-64_windows_testList_1\aqa-tests\TKG\output_17224779936909\PatModImg_Unex_0\20240801-024330-PatModImgTest\modules\7.com.hello.jar
[2024-08-01T02:43:37.099Z] OT3 JUnit version 4.12
[2024-08-01T02:43:37.099Z] OT3 .E
[2024-08-01T02:43:37.099Z] OT3 Time: 0.007
[2024-08-01T02:43:37.099Z] OT3 There was 1 failure:
[2024-08-01T02:43:37.099Z] OT3 1) testOverrideUsingAppModuleAndNewPackage(net.adoptopenjdk.test.modularity.junit.TestOverrideUsingAppModuleAndNewPackage)
[2024-08-01T02:43:37.099Z] OT3 java.lang.IllegalAccessException: class net.adoptopenjdk.test.modularity.junit.TestOverrideUsingAppModuleAndNewPackage (in module com.test) cannot access class adoptopenjdk.test.modularity.hellonew.HelloNew (in module com.hello) because module com.hello does not export adoptopenjdk.test.modularity.hellonew to module com.test
[2024-08-01T02:43:37.099Z] OT3 at java.base/jdk.internal.reflect.Reflection.newIllegalAccessException(Reflection.java:392)
[2024-08-01T02:43:37.099Z] OT3 at java.base/java.lang.reflect.AccessibleObject.checkAccess(AccessibleObject.java:674)
[2024-08-01T02:43:37.099Z] OT3 at java.base/java.lang.reflect.Constructor.newInstanceWithCaller(Constructor.java:490)
[2024-08-01T02:43:37.099Z] OT3 at java.base/java.lang.reflect.Constructor.newInstance(Constructor.java:481)
[2024-08-01T02:43:37.099Z] OT3 at com.test/net.adoptopenjdk.test.modularity.junit.TestOverrideUsingAppModuleAndNewPackage.testOverrideUsingAppModuleAndNewPackage(TestOverrideUsingAppModuleAndNewPackage.java:31)
[2024-08-01T02:43:37.099Z] OT3 at java.base/jdk.internal.reflect.NativeMethodAccessorImpl.invoke0(Native Method)
[2024-08-01T02:43:37.099Z] OT3 at java.base/jdk.internal.reflect.NativeMethodAccessorImpl.invoke(NativeMethodAccessorImpl.java:77)
[2024-08-01T02:43:37.099Z] OT3 at java.base/jdk.internal.reflect.DelegatingMethodAccessorImpl.invoke(DelegatingMethodAccessorImpl.java:43)
[2024-08-01T02:43:37.099Z] OT3 at java.base/java.lang.reflect.Method.invoke(Method.java:569)
[2024-08-01T02:43:37.099Z] OT3 at org.junit.runners.model.FrameworkMethod$1.runReflectiveCall(FrameworkMethod.java:50)
[2024-08-01T02:43:37.099Z] OT3 at org.junit.internal.runners.model.ReflectiveCallable.run(ReflectiveCallable.java:12)
[2024-08-01T02:43:37.099Z] OT3 at org.junit.runners.model.FrameworkMethod.invokeExplosively(FrameworkMethod.java:47)
[2024-08-01T02:43:37.099Z] OT3 at org.junit.internal.runners.statements.InvokeMethod.evaluate(InvokeMethod.java:17)
[2024-08-01T02:43:37.099Z] OT3 at org.junit.runners.ParentRunner.runLeaf(ParentRunner.java:325)
[2024-08-01T02:43:37.099Z] OT3 at org.junit.runners.BlockJUnit4ClassRunner.runChild(BlockJUnit4ClassRunner.java:78)
[2024-08-01T02:43:37.099Z] OT3 at org.junit.runners.BlockJUnit4ClassRunner.runChild(BlockJUnit4ClassRunner.java:57)
[2024-08-01T02:43:37.099Z] OT3 at org.junit.runners.ParentRunner$3.run(ParentRunner.java:290)
[2024-08-01T02:43:37.099Z] OT3 at org.junit.runners.ParentRunner$1.schedule(ParentRunner.java:71)
[2024-08-01T02:43:37.099Z] OT3 at org.junit.runners.ParentRunner.runChildren(ParentRunner.java:288)
[2024-08-01T02:43:37.099Z] OT3 at org.junit.runners.ParentRunner.access$000(ParentRunner.java:58)
[2024-08-01T02:43:37.099Z] OT3 at org.junit.runners.ParentRunner$2.evaluate(ParentRunner.java:268)
[2024-08-01T02:43:37.099Z] OT3 at org.junit.runners.ParentRunner.run(ParentRunner.java:363)
[2024-08-01T02:43:37.099Z] OT3 at org.junit.runners.Suite.runChild(Suite.java:128)
[2024-08-01T02:43:37.099Z] OT3 at org.junit.runners.Suite.runChild(Suite.java:27)
[2024-08-01T02:43:37.099Z] OT3 at org.junit.runners.ParentRunner$3.run(ParentRunner.java:290)
[2024-08-01T02:43:37.099Z] OT3 at org.junit.runners.ParentRunner$1.schedule(ParentRunner.java:71)
[2024-08-01T02:43:37.099Z] OT3 at org.junit.runners.ParentRunner.runChildren(ParentRunner.java:288)
[2024-08-01T02:43:37.099Z] OT3 at org.junit.runners.ParentRunner.access$000(ParentRunner.java:58)
[2024-08-01T02:43:37.099Z] OT3 at org.junit.runners.ParentRunner$2.evaluate(ParentRunner.java:268)
[2024-08-01T02:43:37.099Z] OT3 at org.junit.runners.ParentRunner.run(ParentRunner.java:363)
[2024-08-01T02:43:37.099Z] OT3 at org.junit.runner.JUnitCore.run(JUnitCore.java:137)
[2024-08-01T02:43:37.099Z] OT3 at org.junit.runner.JUnitCore.run(JUnitCore.java:115)
[2024-08-01T02:43:37.099Z] OT3 at org.junit.runner.JUnitCore.runMain(JUnitCore.java:77)
[2024-08-01T02:43:37.099Z] OT3 at org.junit.runner.JUnitCore.main(JUnitCore.java:36)
[2024-08-01T02:43:37.099Z] OT3
[2024-08-01T02:43:37.099Z] OT3 FAILURES!!!
[2024-08-01T02:43:37.099Z] OT3 Tests run: 1, Failures: 1
[2024-08-01T02:43:37.099Z] OT3
[2024-08-01T02:43:37.099Z] STF 02:43:36.840 - Monitoring Report Summary:
[2024-08-01T02:43:37.099Z] STF 02:43:36.840 - o Process OT3 ended with the expected exit code (1)
[2024-08-01T02:43:37.099Z] STF 02:43:36.841 -
[2024-08-01T02:43:37.099Z] STF 02:43:36.841 - +------ Step 10 - Check output
[2024-08-01T02:43:37.099Z] STF 02:43:36.841 - | Count file matches
[2024-08-01T02:43:37.099Z] STF 02:43:36.841 - | TargetFile: C:/jenkins/workspace/Test_openjdk17_hs_sanity.system_x86-64_windows_testList_1/aqa-tests/TKG/output_17224779936909/PatModImg_Unex_0/20240801-024330-PatModImgTest/results/9.OT3.stdout
[2024-08-01T02:43:37.099Z] STF 02:43:36.841 - | ExpectedNumMatches: 1
[2024-08-01T02:43:37.099Z] STF 02:43:36.841 - | SearchStrings: ["java.lang.IllegalAccessException"]
[2024-08-01T02:43:37.099Z] STF 02:43:36.841 - |
[2024-08-01T02:43:37.099Z] STF 02:43:36.841 - Found 1 instances of ["java.lang.IllegalAccessException"]
[2024-08-01T02:43:37.099Z] STF 02:43:36.841 -
[2024-08-01T02:43:37.099Z] STF 02:43:36.841 - +------ Step 11 - Include a new package that is not exported and check if the public type can be accessed by adding --add-exports
[2024-08-01T02:43:37.099Z] STF 02:43:36.841 - | Run foreground process
[2024-08-01T02:43:37.099Z] STF 02:43:36.841 - | Program: C:/jenkins/workspace/Test_openjdk17_hs_sanity.system_x86-64_windows_testList_1/aqa-tests/TKG/output_17224779936909/PatModImg_Unex_0/20240801-024330-PatModImgTest/tmp/6.XpJVM/bin/java
[2024-08-01T02:43:37.099Z] STF 02:43:36.841 - | Mnemonic: OT4
[2024-08-01T02:43:37.099Z] STF 02:43:36.841 - | Echo: ECHO_ON
[2024-08-01T02:43:37.099Z] STF 02:43:36.841 - | Expectation: CLEAN_RUN within 5m
[2024-08-01T02:43:37.099Z] STF 02:43:36.841 - |
[2024-08-01T02:43:37.099Z] STF 02:43:36.841 - Running command: C:/jenkins/workspace/Test_openjdk17_hs_sanity.system_x86-64_windows_testList_1/aqa-tests/TKG/output_17224779936909/PatModImg_Unex_0/20240801-024330-PatModImgTest/tmp/6.XpJVM/bin/java --add-reads com.test=ALL-UNNAMED --add-exports com.hello/adoptopenjdk.test.modularity.hellonew=com.test --patch-module com.hello=C:/jenkins/workspace/Test_openjdk17_hs_sanity.system_x86-64_windows_testList_1/aqa-tests/TKG/output_17224779936909/PatModImg_Unex_0/20240801-024330-PatModImgTest/modules/7.com.hello.jar -XX:+UseCompressedOops -classpath c:/jenkins/testDependency/system_lib/junit/junit.jar;c:/jenkins/testDependency/system_lib/junit/hamcrest-core.jar org.junit.runner.JUnitCore net.adoptopenjdk.test.modularity.junit.TestOverrideUsingAppModuleAndNewPackage
[2024-08-01T02:43:37.099Z] STF 02:43:36.841 - Redirecting stderr to C:/jenkins/workspace/Test_openjdk17_hs_sanity.system_x86-64_windows_testList_1/aqa-tests/TKG/output_17224779936909/PatModImg_Unex_0/20240801-024330-PatModImgTest/results/11.OT4.stderr
[2024-08-01T02:43:37.099Z] STF 02:43:36.841 - Redirecting stdout to C:/jenkins/workspace/Test_openjdk17_hs_sanity.system_x86-64_windows_testList_1/aqa-tests/TKG/output_17224779936909/PatModImg_Unex_0/20240801-024330-PatModImgTest/results/11.OT4.stdout
[2024-08-01T02:43:37.099Z] STF 02:43:36.847 - Monitoring processes: OT4
[2024-08-01T02:43:37.099Z] OT4 stderr WARNING: module-info.class ignored in patch: C:\jenkins\workspace\Test_openjdk17_hs_sanity.system_x86-64_windows_testList_1\aqa-tests\TKG\output_17224779936909\PatModImg_Unex_0\20240801-024330-PatModImgTest\modules\7.com.hello.jar
[2024-08-01T02:43:37.099Z] OT4 JUnit version 4.12
[2024-08-01T02:43:37.450Z] OT4 .
[2024-08-01T02:43:37.450Z] OT4 Time: 0.006
[2024-08-01T02:43:37.450Z] OT4
[2024-08-01T02:43:37.450Z] OT4 OK (1 test)
[2024-08-01T02:43:37.450Z] OT4
[2024-08-01T02:43:37.450Z] STF 02:43:37.131 - Monitoring Report Summary:
[2024-08-01T02:43:37.450Z] STF 02:43:37.131 - o Process OT4 ended with the expected exit code (0)
[2024-08-01T02:43:37.450Z] STF 02:43:37.132 - EXECUTE stage completed
[2024-08-01T02:43:37.450Z] STF 02:43:37.146 -
[2024-08-01T02:43:37.450Z] STF 02:43:37.146 - ==================== T E A R D O W N ====================
[2024-08-01T02:43:37.450Z] STF 02:43:37.146 - Running teardown: perl C:/jenkins/workspace/Test_openjdk17_hs_sanity.system_x86-64_windows_testList_1/aqa-tests/\TKG\output_17224779936909\PatModImg_Unex_0/20240801-024330-PatModImgTest/tearDown.pl
[2024-08-01T02:43:37.450Z] STF 02:43:37.270 - TEARDOWN stage completed
[2024-08-01T02:43:37.450Z] STF 02:43:37.285 -
[2024-08-01T02:43:37.450Z] STF 02:43:37.285 - ===================== R E S U L T S =====================
[2024-08-01T02:43:37.450Z] STF 02:43:37.285 - Stage results:
[2024-08-01T02:43:37.450Z] STF 02:43:37.285 - setUp: pass
[2024-08-01T02:43:37.450Z] STF 02:43:37.285 - execute: pass
[2024-08-01T02:43:37.450Z] STF 02:43:37.285 - teardown: pass
[2024-08-01T02:43:37.450Z] STF 02:43:37.285 -
[2024-08-01T02:43:37.450Z] STF 02:43:37.285 - Overall result: PASSED
[2024-08-01T02:43:37.450Z] -----------------------------------
[2024-08-01T02:43:37.450Z] PatModImg_Unex_0_PASSED
[2024-08-01T02:43:37.450Z] -----------------------------------
[2024-08-01T02:43:37.450Z]
[2024-08-01T02:43:37.450Z] TEST TEARDOWN:
[2024-08-01T02:43:37.450Z] Nothing to be done for teardown.
[2024-08-01T02:43:37.762Z] PatModImg_Unex_0 Finish Time: Thu Aug 1 02:43:37 2024 Epoch Time (ms): 1722480217642