PatMod_Adv_0
[2024-08-15T07:45:28.200Z] Running test PatMod_Adv_0 ...
[2024-08-15T07:45:28.200Z] ===============================================
[2024-08-15T07:45:28.200Z] PatMod_Adv_0 Start Time: Thu Aug 15 07:45:27 2024 Epoch Time (ms): 1723707927402
[2024-08-15T07:45:28.200Z] variation: Mode150
[2024-08-15T07:45:28.200Z] JVM_OPTIONS: -XX:+UseCompressedOops
[2024-08-15T07:45:28.200Z] { \
[2024-08-15T07:45:28.200Z] echo ""; echo "TEST SETUP:"; \
[2024-08-15T07:45:28.200Z] echo "Nothing to be done for setup."; \
[2024-08-15T07:45:28.200Z] mkdir -p "/home/jenkins/workspace/Test_openjdk17_hs_sanity.system_x86-64_alpine-linux_testList_2/aqa-tests/TKG/../TKG/output_17237078174752/PatMod_Adv_0"; \
[2024-08-15T07:45:28.200Z] cd "/home/jenkins/workspace/Test_openjdk17_hs_sanity.system_x86-64_alpine-linux_testList_2/aqa-tests/TKG/../TKG/output_17237078174752/PatMod_Adv_0"; \
[2024-08-15T07:45:28.200Z] echo ""; echo "TESTING:"; \
[2024-08-15T07:45:28.200Z] perl /home/jenkins/workspace/Test_openjdk17_hs_sanity.system_x86-64_alpine-linux_testList_2/aqa-tests/TKG/../../jvmtest/system/modularity/..//STF/stf.core/scripts/stf.pl -test-root="/home/jenkins/workspace/Test_openjdk17_hs_sanity.system_x86-64_alpine-linux_testList_2/aqa-tests/TKG/../../jvmtest/system/modularity/..//STF;/home/jenkins/workspace/Test_openjdk17_hs_sanity.system_x86-64_alpine-linux_testList_2/aqa-tests/TKG/../../jvmtest/system/modularity/..//aqa-systemtest""" -systemtest-prereqs="/home/jenkins/workspace/Test_openjdk17_hs_sanity.system_x86-64_alpine-linux_testList_2/../../testDependency/system_lib/" -java-args=' -XX:+UseCompressedOops ' -results-root="/home/jenkins/workspace/Test_openjdk17_hs_sanity.system_x86-64_alpine-linux_testList_2/aqa-tests/TKG/../TKG/output_17237078174752/PatMod_Adv_0" -test=PatModTest -test-args="variant=Adv"; \
[2024-08-15T07:45:28.200Z] if [ $? -eq 0 ]; then echo "-----------------------------------"; echo "PatMod_Adv_0""_PASSED"; echo "-----------------------------------"; cd /home/jenkins/workspace/Test_openjdk17_hs_sanity.system_x86-64_alpine-linux_testList_2/aqa-tests/TKG/..; rm -f -r "/home/jenkins/workspace/Test_openjdk17_hs_sanity.system_x86-64_alpine-linux_testList_2/aqa-tests/TKG/../TKG/output_17237078174752/PatMod_Adv_0"; else echo "-----------------------------------"; echo "PatMod_Adv_0""_FAILED"; echo "-----------------------------------"; fi; \
[2024-08-15T07:45:28.200Z] echo ""; echo "TEST TEARDOWN:"; \
[2024-08-15T07:45:28.200Z] echo "Nothing to be done for teardown."; \
[2024-08-15T07:45:28.200Z] } 2>&1 | tee -a "/home/jenkins/workspace/Test_openjdk17_hs_sanity.system_x86-64_alpine-linux_testList_2/aqa-tests/TKG/../TKG/output_17237078174752/TestTargetResult";
[2024-08-15T07:45:28.200Z]
[2024-08-15T07:45:28.200Z] TEST SETUP:
[2024-08-15T07:45:28.200Z] Nothing to be done for setup.
[2024-08-15T07:45:28.200Z]
[2024-08-15T07:45:28.200Z] TESTING:
[2024-08-15T07:45:28.200Z] STF 07:45:27.493 - ========================= S T F =========================
[2024-08-15T07:45:28.200Z] systemtest-prereqs has been processed, and set to: /home/jenkins/testDependency/system_libRetrieving amount of free space on drive containing /home/jenkins/workspace/Test_openjdk17_hs_sanity.system_x86-64_alpine-linux_testList_2/aqa-tests/TKG/../TKG/output_17237078174752/PatMod_Adv_0
[2024-08-15T07:45:28.200Z] There is 249880 Mb free
[2024-08-15T07:45:28.200Z] STF 07:45:27.500 - ================== G E N E R A T I O N ==================
[2024-08-15T07:45:28.200Z] STF 07:45:27.501 - Checking JVM: /home/jenkins/workspace/Test_openjdk17_hs_sanity.system_x86-64_alpine-linux_testList_2/jdkbinary/j2sdk-image
[2024-08-15T07:45:28.200Z] STF 07:45:27.501 - Starting process to generate scripts: /home/jenkins/workspace/Test_openjdk17_hs_sanity.system_x86-64_alpine-linux_testList_2/jdkbinary/j2sdk-image/bin/java -Dlog4j.skipJansi=true -Djava.system.class.loader=net.adoptopenjdk.stf.runner.StfClassLoader -classpath /home/jenkins/workspace/Test_openjdk17_hs_sanity.system_x86-64_alpine-linux_testList_2/../../testDependency/system_lib//log4j/log4j-api.jar:/home/jenkins/workspace/Test_openjdk17_hs_sanity.system_x86-64_alpine-linux_testList_2/../../testDependency/system_lib//log4j/log4j-core.jar:/home/jenkins/workspace/Test_openjdk17_hs_sanity.system_x86-64_alpine-linux_testList_2/jvmtest/system/STF/stf.core/scripts/../bin net.adoptopenjdk.stf.runner.StfRunner -properties "/home/jenkins/workspace/Test_openjdk17_hs_sanity.system_x86-64_alpine-linux_testList_2/aqa-tests/TKG/../TKG/output_17237078174752/PatMod_Adv_0/20240815-074527-PatModTest/stf_parameters.properties, , /home/jenkins/workspace/Test_openjdk17_hs_sanity.system_x86-64_alpine-linux_testList_2/jvmtest/system/STF/stf.core/config/stf.properties" -testDir "/home/jenkins/workspace/Test_openjdk17_hs_sanity.system_x86-64_alpine-linux_testList_2/aqa-tests/TKG/../TKG/output_17237078174752/PatMod_Adv_0/20240815-074527-PatModTest"
[2024-08-15T07:45:28.200Z] GEN stderr OpenJDK 64-Bit Server VM warning: Archived non-system classes are disabled because the java.system.class.loader property is specified (value = "net.adoptopenjdk.stf.runner.StfClassLoader"). To use archived non-system classes, this property must not be set
[2024-08-15T07:45:29.005Z] GEN 07:45:28.822 - Found test. Project: 'openjdk.test.modularity' class: 'PatModTest.class' Dir: '/home/jenkins/workspace/Test_openjdk17_hs_sanity.system_x86-64_alpine-linux_testList_2/jvmtest/system/aqa-systemtest/openjdk.test.modularity/bin'
[2024-08-15T07:45:29.005Z] GEN 07:45:28.837 - Found test. Project: 'openjdk.test.modularity' class: 'net.adoptopenjdk.test.modularity.PatModTest'
[2024-08-15T07:45:29.803Z] GEN Classpath directories used by project 'openjdk.test.modularity':
[2024-08-15T07:45:29.803Z] GEN /home/jenkins/workspace/Test_openjdk17_hs_sanity.system_x86-64_alpine-linux_testList_2/jvmtest/system/aqa-systemtest/openjdk.test.modularity/bin/common-mods/displayService
[2024-08-15T07:45:29.803Z] GEN /home/jenkins/workspace/Test_openjdk17_hs_sanity.system_x86-64_alpine-linux_testList_2/jvmtest/system/aqa-systemtest/openjdk.test.modularity/bin/common-mods/com.helper
[2024-08-15T07:45:29.803Z] GEN /home/jenkins/workspace/Test_openjdk17_hs_sanity.system_x86-64_alpine-linux_testList_2/jvmtest/system/aqa-systemtest/openjdk.test.modularity/bin/common-mods/displayServiceImpl1
[2024-08-15T07:45:29.803Z] GEN /home/jenkins/workspace/Test_openjdk17_hs_sanity.system_x86-64_alpine-linux_testList_2/jvmtest/system/aqa-systemtest/openjdk.test.modularity/bin/common-mods/com.discreet
[2024-08-15T07:45:29.803Z] GEN /home/jenkins/workspace/Test_openjdk17_hs_sanity.system_x86-64_alpine-linux_testList_2/jvmtest/system/aqa-systemtest/openjdk.test.modularity/bin/common-mods/com.hello
[2024-08-15T07:45:29.803Z] GEN /home/jenkins/workspace/Test_openjdk17_hs_sanity.system_x86-64_alpine-linux_testList_2/jvmtest/system/aqa-systemtest/openjdk.test.modularity/bin/common-mods/com.hola
[2024-08-15T07:45:29.803Z] GEN /home/jenkins/workspace/Test_openjdk17_hs_sanity.system_x86-64_alpine-linux_testList_2/jvmtest/system/aqa-systemtest/openjdk.test.modularity/bin/common-mods/displayServiceImpl2
[2024-08-15T07:45:29.803Z] GEN /home/jenkins/workspace/Test_openjdk17_hs_sanity.system_x86-64_alpine-linux_testList_2/jvmtest/system/aqa-systemtest/openjdk.test.modularity/bin/common-mods/com.hi
[2024-08-15T07:45:29.803Z] GEN /home/jenkins/workspace/Test_openjdk17_hs_sanity.system_x86-64_alpine-linux_testList_2/jvmtest/system/aqa-systemtest/openjdk.test.modularity/bin/common-override
[2024-08-15T07:45:29.803Z] GEN /home/jenkins/workspace/Test_openjdk17_hs_sanity.system_x86-64_alpine-linux_testList_2/jvmtest/system/aqa-systemtest/openjdk.test.modularity/bin/common-override-new
[2024-08-15T07:45:29.803Z] GEN /home/jenkins/workspace/Test_openjdk17_hs_sanity.system_x86-64_alpine-linux_testList_2/jvmtest/system/aqa-systemtest/openjdk.test.modularity/bin/common/displayServiceImpl3
[2024-08-15T07:45:29.803Z] GEN /home/jenkins/workspace/Test_openjdk17_hs_sanity.system_x86-64_alpine-linux_testList_2/jvmtest/system/aqa-systemtest/openjdk.test.modularity/bin/common/displayServiceImpl4
[2024-08-15T07:45:29.803Z] GEN /home/jenkins/workspace/Test_openjdk17_hs_sanity.system_x86-64_alpine-linux_testList_2/jvmtest/system/aqa-systemtest/openjdk.test.modularity/bin/common
[2024-08-15T07:45:29.803Z] GEN /home/jenkins/workspace/Test_openjdk17_hs_sanity.system_x86-64_alpine-linux_testList_2/jvmtest/system/aqa-systemtest/openjdk.test.modularity/bin/tests
[2024-08-15T07:45:29.803Z] GEN /home/jenkins/workspace/Test_openjdk17_hs_sanity.system_x86-64_alpine-linux_testList_2/jvmtest/system/aqa-systemtest/openjdk.test.modularity/bin
[2024-08-15T07:45:29.803Z] GEN /home/jenkins/workspace/Test_openjdk17_hs_sanity.system_x86-64_alpine-linux_testList_2/jvmtest/system/STF/stf.core/bin
[2024-08-15T07:45:29.803Z] GEN /home/jenkins/testDependency/system_lib/log4j/log4j-api.jar
[2024-08-15T07:45:29.803Z] GEN /home/jenkins/testDependency/system_lib/log4j/log4j-core.jar
[2024-08-15T07:45:29.804Z] GEN /home/jenkins/testDependency/system_lib/junit/junit.jar
[2024-08-15T07:45:29.804Z] GEN 07:45:29.105 - Using Mode NoOptions. Values = ''
[2024-08-15T07:45:29.804Z] GEN 07:45:29.239 -
[2024-08-15T07:45:29.804Z] GEN 07:45:29.239 - Test command summary:
[2024-08-15T07:45:29.804Z] GEN 07:45:29.240 - Step Stage Command Description
[2024-08-15T07:45:29.804Z] GEN 07:45:29.240 - -----+--------+-----------------+------------
[2024-08-15T07:45:29.804Z] GEN 07:45:29.240 - 1 execute jar Create com.hello jar
[2024-08-15T07:45:29.804Z] GEN 07:45:29.240 - 2 execute jar Create com.discreet jar
[2024-08-15T07:45:29.804Z] GEN 07:45:29.240 - 3 execute jar create java.xml.jar
[2024-08-15T07:45:29.804Z] GEN 07:45:29.240 - 4 execute Run java Run application class override test where we specify two exploded module paths in a single --patch-module option
[2024-08-15T07:45:29.804Z] GEN 07:45:29.240 - 5 execute Run java (Negative test) Verify if a module can be specified only once on --patch-module
[2024-08-15T07:45:29.804Z] GEN 07:45:29.240 - 6 execute Run java Combine stderr and stdout files of process OT7
[2024-08-15T07:45:29.804Z] GEN 07:45:29.244 - 7 execute count Check output
[2024-08-15T07:45:29.804Z] GEN 07:45:29.244 - 8 execute Run java (Negative test) Verify if --patch-module allows replacing of module-info.class
[2024-08-15T07:45:29.804Z] GEN 07:45:29.244 - 9 execute count Check output
[2024-08-15T07:45:29.804Z] STF 07:45:29.289 -
[2024-08-15T07:45:29.804Z] STF 07:45:29.290 - Script generation completed
[2024-08-15T07:45:29.804Z] STF 07:45:29.290 -
[2024-08-15T07:45:29.804Z] STF 07:45:29.291 -
[2024-08-15T07:45:29.804Z] STF 07:45:29.291 - ======================= S E T U P =======================
[2024-08-15T07:45:29.804Z] STF 07:45:29.291 - Running setup: perl /home/jenkins/workspace/Test_openjdk17_hs_sanity.system_x86-64_alpine-linux_testList_2/aqa-tests/TKG/../TKG/output_17237078174752/PatMod_Adv_0/20240815-074527-PatModTest/setUp.pl
[2024-08-15T07:45:29.804Z] STF 07:45:29.374 - SETUP stage completed
[2024-08-15T07:45:29.804Z] STF 07:45:29.379 -
[2024-08-15T07:45:29.804Z] STF 07:45:29.379 - ==================== E X E C U T E - ====================
[2024-08-15T07:45:29.804Z] STF 07:45:29.379 - Running execute: perl /home/jenkins/workspace/Test_openjdk17_hs_sanity.system_x86-64_alpine-linux_testList_2/aqa-tests/TKG/../TKG/output_17237078174752/PatMod_Adv_0/20240815-074527-PatModTest/execute.pl
[2024-08-15T07:45:29.804Z] STF 07:45:29.464 -
[2024-08-15T07:45:29.804Z] STF 07:45:29.464 - Java version
[2024-08-15T07:45:29.804Z] STF 07:45:29.464 - Running: /home/jenkins/workspace/Test_openjdk17_hs_sanity.system_x86-64_alpine-linux_testList_2/jdkbinary/j2sdk-image/bin/java -version
[2024-08-15T07:45:29.804Z] openjdk version "17.0.13-beta" 2024-10-15
[2024-08-15T07:45:29.804Z] OpenJDK Runtime Environment Temurin-17.0.13+3-202408142035 (build 17.0.13-beta+3-ea)
[2024-08-15T07:45:29.804Z] OpenJDK 64-Bit Server VM Temurin-17.0.13+3-202408142035 (build 17.0.13-beta+3-ea, mixed mode, sharing)
[2024-08-15T07:45:29.804Z] STF 07:45:29.558 -
[2024-08-15T07:45:29.804Z] STF 07:45:29.558 - +------ Step 1 - Create com.hello jar
[2024-08-15T07:45:29.804Z] STF 07:45:29.558 - | Create modular jar
[2024-08-15T07:45:29.804Z] STF 07:45:29.558 - | ModuleSpec: openjdk.test.modularity/bin/common-override/com.hello
[2024-08-15T07:45:29.804Z] STF 07:45:29.558 - | ModuleVersion: null
[2024-08-15T07:45:29.804Z] STF 07:45:29.558 - | MainClass: null
[2024-08-15T07:45:29.804Z] STF 07:45:29.558 - | HashModules: null
[2024-08-15T07:45:29.804Z] STF 07:45:29.558 - |
[2024-08-15T07:45:29.804Z] STF 07:45:29.559 - Running command: /home/jenkins/workspace/Test_openjdk17_hs_sanity.system_x86-64_alpine-linux_testList_2/jdkbinary/j2sdk-image/bin/jar --create --file /home/jenkins/workspace/Test_openjdk17_hs_sanity.system_x86-64_alpine-linux_testList_2/aqa-tests/TKG/output_17237078174752/PatMod_Adv_0/20240815-074527-PatModTest/modules/1.com.hello.jar -C /home/jenkins/workspace/Test_openjdk17_hs_sanity.system_x86-64_alpine-linux_testList_2/jvmtest/system/aqa-systemtest/openjdk.test.modularity/bin/common-override/com.hello .
[2024-08-15T07:45:29.804Z] STF 07:45:29.559 - Redirecting stderr to /home/jenkins/workspace/Test_openjdk17_hs_sanity.system_x86-64_alpine-linux_testList_2/aqa-tests/TKG/output_17237078174752/PatMod_Adv_0/20240815-074527-PatModTest/results/1.CMJ.stderr
[2024-08-15T07:45:29.804Z] STF 07:45:29.559 - Redirecting stdout to /home/jenkins/workspace/Test_openjdk17_hs_sanity.system_x86-64_alpine-linux_testList_2/aqa-tests/TKG/output_17237078174752/PatMod_Adv_0/20240815-074527-PatModTest/results/1.CMJ.stdout
[2024-08-15T07:45:29.804Z] STF 07:45:29.579 - Monitoring processes: CMJ
[2024-08-15T07:45:30.600Z] STF 07:45:29.858 - Monitoring Report Summary:
[2024-08-15T07:45:30.600Z] STF 07:45:29.858 - o Process CMJ ended with the expected exit code (0)
[2024-08-15T07:45:30.600Z] STF 07:45:29.858 - Created modular jar: 1.com.hello.jar
[2024-08-15T07:45:30.600Z] STF 07:45:29.858 -
[2024-08-15T07:45:30.600Z] STF 07:45:29.858 - +------ Step 2 - Create com.discreet jar
[2024-08-15T07:45:30.600Z] STF 07:45:29.859 - | Create modular jar
[2024-08-15T07:45:30.600Z] STF 07:45:29.859 - | ModuleSpec: openjdk.test.modularity/bin/common-override/com.discreet
[2024-08-15T07:45:30.600Z] STF 07:45:29.859 - | ModuleVersion: null
[2024-08-15T07:45:30.600Z] STF 07:45:29.859 - | MainClass: null
[2024-08-15T07:45:30.600Z] STF 07:45:29.859 - | HashModules: null
[2024-08-15T07:45:30.600Z] STF 07:45:29.859 - |
[2024-08-15T07:45:30.600Z] STF 07:45:29.859 - Running command: /home/jenkins/workspace/Test_openjdk17_hs_sanity.system_x86-64_alpine-linux_testList_2/jdkbinary/j2sdk-image/bin/jar --create --file /home/jenkins/workspace/Test_openjdk17_hs_sanity.system_x86-64_alpine-linux_testList_2/aqa-tests/TKG/output_17237078174752/PatMod_Adv_0/20240815-074527-PatModTest/modules/2.com.discreet.jar -C /home/jenkins/workspace/Test_openjdk17_hs_sanity.system_x86-64_alpine-linux_testList_2/jvmtest/system/aqa-systemtest/openjdk.test.modularity/bin/common-override/com.discreet .
[2024-08-15T07:45:30.600Z] STF 07:45:29.859 - Redirecting stderr to /home/jenkins/workspace/Test_openjdk17_hs_sanity.system_x86-64_alpine-linux_testList_2/aqa-tests/TKG/output_17237078174752/PatMod_Adv_0/20240815-074527-PatModTest/results/2.CMJ.stderr
[2024-08-15T07:45:30.600Z] STF 07:45:29.859 - Redirecting stdout to /home/jenkins/workspace/Test_openjdk17_hs_sanity.system_x86-64_alpine-linux_testList_2/aqa-tests/TKG/output_17237078174752/PatMod_Adv_0/20240815-074527-PatModTest/results/2.CMJ.stdout
[2024-08-15T07:45:30.600Z] STF 07:45:29.861 - Monitoring processes: CMJ
[2024-08-15T07:45:30.600Z] STF 07:45:30.134 - Monitoring Report Summary:
[2024-08-15T07:45:30.600Z] STF 07:45:30.134 - o Process CMJ ended with the expected exit code (0)
[2024-08-15T07:45:30.600Z] STF 07:45:30.134 - Created modular jar: 2.com.discreet.jar
[2024-08-15T07:45:30.600Z] STF 07:45:30.134 -
[2024-08-15T07:45:30.600Z] STF 07:45:30.134 - +------ Step 3 - create java.xml.jar
[2024-08-15T07:45:30.600Z] STF 07:45:30.134 - | Create modular jar
[2024-08-15T07:45:30.600Z] STF 07:45:30.134 - | ModuleSpec: openjdk.test.modularity/bin/common-override/java.xml
[2024-08-15T07:45:30.600Z] STF 07:45:30.134 - | ModuleVersion: null
[2024-08-15T07:45:30.600Z] STF 07:45:30.134 - | MainClass: null
[2024-08-15T07:45:30.600Z] STF 07:45:30.134 - | HashModules: null
[2024-08-15T07:45:30.600Z] STF 07:45:30.134 - |
[2024-08-15T07:45:30.600Z] STF 07:45:30.135 - Running command: /home/jenkins/workspace/Test_openjdk17_hs_sanity.system_x86-64_alpine-linux_testList_2/jdkbinary/j2sdk-image/bin/jar --create --file /home/jenkins/workspace/Test_openjdk17_hs_sanity.system_x86-64_alpine-linux_testList_2/aqa-tests/TKG/output_17237078174752/PatMod_Adv_0/20240815-074527-PatModTest/modules/3.java.xml.jar -C /home/jenkins/workspace/Test_openjdk17_hs_sanity.system_x86-64_alpine-linux_testList_2/jvmtest/system/aqa-systemtest/openjdk.test.modularity/bin/common-override/java.xml .
[2024-08-15T07:45:30.600Z] STF 07:45:30.135 - Redirecting stderr to /home/jenkins/workspace/Test_openjdk17_hs_sanity.system_x86-64_alpine-linux_testList_2/aqa-tests/TKG/output_17237078174752/PatMod_Adv_0/20240815-074527-PatModTest/results/3.CMJ.stderr
[2024-08-15T07:45:30.600Z] STF 07:45:30.135 - Redirecting stdout to /home/jenkins/workspace/Test_openjdk17_hs_sanity.system_x86-64_alpine-linux_testList_2/aqa-tests/TKG/output_17237078174752/PatMod_Adv_0/20240815-074527-PatModTest/results/3.CMJ.stdout
[2024-08-15T07:45:30.600Z] STF 07:45:30.136 - Monitoring processes: CMJ
[2024-08-15T07:45:30.600Z] STF 07:45:30.404 - Monitoring Report Summary:
[2024-08-15T07:45:30.600Z] STF 07:45:30.404 - o Process CMJ ended with the expected exit code (0)
[2024-08-15T07:45:30.600Z] STF 07:45:30.405 - Created modular jar: 3.java.xml.jar
[2024-08-15T07:45:30.600Z] STF 07:45:30.405 -
[2024-08-15T07:45:30.600Z] STF 07:45:30.405 - +------ Step 4 - Run application class override test where we specify two exploded module paths in a single --patch-module option
[2024-08-15T07:45:30.600Z] STF 07:45:30.405 - | Run foreground process
[2024-08-15T07:45:30.600Z] STF 07:45:30.405 - | Program: /home/jenkins/workspace/Test_openjdk17_hs_sanity.system_x86-64_alpine-linux_testList_2/jdkbinary/j2sdk-image/bin/java
[2024-08-15T07:45:30.600Z] STF 07:45:30.405 - | Mnemonic: OT56
[2024-08-15T07:45:30.600Z] STF 07:45:30.405 - | Echo: ECHO_ON
[2024-08-15T07:45:30.600Z] STF 07:45:30.405 - | Expectation: CLEAN_RUN within 1m
[2024-08-15T07:45:30.600Z] STF 07:45:30.405 - |
[2024-08-15T07:45:30.600Z] STF 07:45:30.405 - Running command: /home/jenkins/workspace/Test_openjdk17_hs_sanity.system_x86-64_alpine-linux_testList_2/jdkbinary/j2sdk-image/bin/java --add-reads com.test=ALL-UNNAMED --module-path /home/jenkins/workspace/Test_openjdk17_hs_sanity.system_x86-64_alpine-linux_testList_2/jvmtest/system/aqa-systemtest/openjdk.test.modularity/bin/common-mods:/home/jenkins/workspace/Test_openjdk17_hs_sanity.system_x86-64_alpine-linux_testList_2/jvmtest/system/aqa-systemtest/openjdk.test.modularity/bin/tests --add-modules=com.test --add-exports com.hello/adoptopenjdk.test.modularity.newpkg=com.test --patch-module com.hello=/home/jenkins/workspace/Test_openjdk17_hs_sanity.system_x86-64_alpine-linux_testList_2/jvmtest/system/aqa-systemtest/openjdk.test.modularity/bin/common-override/com.hello:/home/jenkins/workspace/Test_openjdk17_hs_sanity.system_x86-64_alpine-linux_testList_2/jvmtest/system/aqa-systemtest/openjdk.test.modularity/bin/common-override-new/com.hello -XX:+UseCompressedOops -classpath /home/jenkins/testDependency/system_lib/junit/junit.jar:/home/jenkins/testDependency/system_lib/junit/hamcrest-core.jar org.junit.runner.JUnitCore net.adoptopenjdk.test.modularity.junit.TestOverrideUsingMultipleFilePaths
[2024-08-15T07:45:30.600Z] STF 07:45:30.405 - Redirecting stderr to /home/jenkins/workspace/Test_openjdk17_hs_sanity.system_x86-64_alpine-linux_testList_2/aqa-tests/TKG/output_17237078174752/PatMod_Adv_0/20240815-074527-PatModTest/results/4.OT56.stderr
[2024-08-15T07:45:30.600Z] STF 07:45:30.405 - Redirecting stdout to /home/jenkins/workspace/Test_openjdk17_hs_sanity.system_x86-64_alpine-linux_testList_2/aqa-tests/TKG/output_17237078174752/PatMod_Adv_0/20240815-074527-PatModTest/results/4.OT56.stdout
[2024-08-15T07:45:30.600Z] STF 07:45:30.407 - Monitoring processes: OT56
[2024-08-15T07:45:31.402Z] OT56 stderr WARNING: module-info.class ignored in patch: /home/jenkins/workspace/Test_openjdk17_hs_sanity.system_x86-64_alpine-linux_testList_2/jvmtest/system/aqa-systemtest/openjdk.test.modularity/bin/common-override/com.hello
[2024-08-15T07:45:31.402Z] OT56 stderr WARNING: module-info.class ignored in patch: /home/jenkins/workspace/Test_openjdk17_hs_sanity.system_x86-64_alpine-linux_testList_2/jvmtest/system/aqa-systemtest/openjdk.test.modularity/bin/common-override-new/com.hello
[2024-08-15T07:45:31.402Z] OT56 JUnit version 4.12
[2024-08-15T07:45:31.402Z] OT56 ...
[2024-08-15T07:45:31.402Z] OT56 Time: 0.02
[2024-08-15T07:45:31.402Z] OT56
[2024-08-15T07:45:31.402Z] OT56 OK (3 tests)
[2024-08-15T07:45:31.402Z] OT56
[2024-08-15T07:45:31.402Z] STF 07:45:30.911 - Monitoring Report Summary:
[2024-08-15T07:45:31.402Z] STF 07:45:30.911 - o Process OT56 ended with the expected exit code (0)
[2024-08-15T07:45:31.402Z] STF 07:45:30.911 -
[2024-08-15T07:45:31.402Z] STF 07:45:30.911 - +------ Step 5 - (Negative test) Verify if a module can be specified only once on --patch-module
[2024-08-15T07:45:31.402Z] STF 07:45:30.911 - | Run foreground process
[2024-08-15T07:45:31.402Z] STF 07:45:30.911 - | Program: /home/jenkins/workspace/Test_openjdk17_hs_sanity.system_x86-64_alpine-linux_testList_2/jdkbinary/j2sdk-image/bin/java
[2024-08-15T07:45:31.402Z] STF 07:45:30.911 - | Mnemonic: OT7
[2024-08-15T07:45:31.402Z] STF 07:45:30.911 - | Echo: ECHO_ON
[2024-08-15T07:45:31.402Z] STF 07:45:30.911 - | Expectation: NON_ZERO_EXIT [1] within 1m
[2024-08-15T07:45:31.402Z] STF 07:45:30.911 - |
[2024-08-15T07:45:31.403Z] STF 07:45:30.912 - Running command: /home/jenkins/workspace/Test_openjdk17_hs_sanity.system_x86-64_alpine-linux_testList_2/jdkbinary/j2sdk-image/bin/java --add-reads com.test=ALL-UNNAMED --module-path /home/jenkins/workspace/Test_openjdk17_hs_sanity.system_x86-64_alpine-linux_testList_2/jvmtest/system/aqa-systemtest/openjdk.test.modularity/bin/common-mods:/home/jenkins/workspace/Test_openjdk17_hs_sanity.system_x86-64_alpine-linux_testList_2/jvmtest/system/aqa-systemtest/openjdk.test.modularity/bin/tests --add-modules=com.test --patch-module com.hello=/home/jenkins/workspace/Test_openjdk17_hs_sanity.system_x86-64_alpine-linux_testList_2/jvmtest/system/aqa-systemtest/openjdk.test.modularity/bin/common-override-new/com.hello --patch-module com.hello=/home/jenkins/workspace/Test_openjdk17_hs_sanity.system_x86-64_alpine-linux_testList_2/jvmtest/system/aqa-systemtest/openjdk.test.modularity/bin/common-override/com.hello -XX:+UseCompressedOops -classpath /home/jenkins/testDependency/system_lib/junit/junit.jar:/home/jenkins/testDependency/system_lib/junit/hamcrest-core.jar org.junit.runner.JUnitCore net.adoptopenjdk.test.modularity.junit.TestOverrideUsingAppModule
[2024-08-15T07:45:31.403Z] STF 07:45:30.912 - Redirecting stderr to /home/jenkins/workspace/Test_openjdk17_hs_sanity.system_x86-64_alpine-linux_testList_2/aqa-tests/TKG/output_17237078174752/PatMod_Adv_0/20240815-074527-PatModTest/results/5.OT7.stderr
[2024-08-15T07:45:31.403Z] STF 07:45:30.912 - Redirecting stdout to /home/jenkins/workspace/Test_openjdk17_hs_sanity.system_x86-64_alpine-linux_testList_2/aqa-tests/TKG/output_17237078174752/PatMod_Adv_0/20240815-074527-PatModTest/results/5.OT7.stdout
[2024-08-15T07:45:31.403Z] STF 07:45:30.913 - Monitoring processes: OT7
[2024-08-15T07:45:31.403Z] OT7 Error occurred during initialization of boot layer
[2024-08-15T07:45:31.403Z] OT7 java.lang.ExceptionInInitializerError
[2024-08-15T07:45:31.403Z] OT7 Caused by: java.lang.RuntimeException: com.hello specified more than once to --patch-module
[2024-08-15T07:45:31.403Z] STF 07:45:31.066 - Monitoring Report Summary:
[2024-08-15T07:45:31.403Z] STF 07:45:31.066 - o Process OT7 ended with the expected exit code (1)
[2024-08-15T07:45:31.403Z] STF 07:45:31.066 -
[2024-08-15T07:45:31.403Z] STF 07:45:31.066 - +------ Step 6 - Combine stderr and stdout files of process OT7
[2024-08-15T07:45:31.403Z] STF 07:45:31.066 - | Run foreground process
[2024-08-15T07:45:31.403Z] STF 07:45:31.066 - | Program: /home/jenkins/workspace/Test_openjdk17_hs_sanity.system_x86-64_alpine-linux_testList_2/jdkbinary/j2sdk-image/bin/java
[2024-08-15T07:45:31.403Z] STF 07:45:31.066 - | Mnemonic: CO
[2024-08-15T07:45:31.403Z] STF 07:45:31.066 - | Echo: ECHO_OFF
[2024-08-15T07:45:31.403Z] STF 07:45:31.066 - | Expectation: NON_ZERO_EXIT [0] within 30s
[2024-08-15T07:45:31.403Z] STF 07:45:31.066 - |
[2024-08-15T07:45:31.403Z] STF 07:45:31.066 - Running command: /home/jenkins/workspace/Test_openjdk17_hs_sanity.system_x86-64_alpine-linux_testList_2/jdkbinary/j2sdk-image/bin/java -Dfile1=/home/jenkins/workspace/Test_openjdk17_hs_sanity.system_x86-64_alpine-linux_testList_2/aqa-tests/TKG/output_17237078174752/PatMod_Adv_0/20240815-074527-PatModTest/results/5.OT7.stdout -Dfile2=/home/jenkins/workspace/Test_openjdk17_hs_sanity.system_x86-64_alpine-linux_testList_2/aqa-tests/TKG/output_17237078174752/PatMod_Adv_0/20240815-074527-PatModTest/results/5.OT7.stderr -Dfinal.file=/home/jenkins/workspace/Test_openjdk17_hs_sanity.system_x86-64_alpine-linux_testList_2/aqa-tests/TKG/output_17237078174752/PatMod_Adv_0/20240815-074527-PatModTest/results/combinedOT7.txt -XX:+UseCompressedOops -classpath /home/jenkins/workspace/Test_openjdk17_hs_sanity.system_x86-64_alpine-linux_testList_2/jvmtest/system/STF/stf.core/bin:/home/jenkins/workspace/Test_openjdk17_hs_sanity.system_x86-64_alpine-linux_testList_2/jvmtest/system/aqa-systemtest/openjdk.test.modularity/bin net.adoptopenjdk.test.modularity.TestUtil
[2024-08-15T07:45:31.403Z] STF 07:45:31.066 - Redirecting stderr to /home/jenkins/workspace/Test_openjdk17_hs_sanity.system_x86-64_alpine-linux_testList_2/aqa-tests/TKG/output_17237078174752/PatMod_Adv_0/20240815-074527-PatModTest/results/6.CO.stderr
[2024-08-15T07:45:31.403Z] STF 07:45:31.066 - Redirecting stdout to /home/jenkins/workspace/Test_openjdk17_hs_sanity.system_x86-64_alpine-linux_testList_2/aqa-tests/TKG/output_17237078174752/PatMod_Adv_0/20240815-074527-PatModTest/results/6.CO.stdout
[2024-08-15T07:45:31.403Z] STF 07:45:31.068 - Monitoring processes: CO
[2024-08-15T07:45:31.403Z] STF 07:45:31.229 - Monitoring Report Summary:
[2024-08-15T07:45:31.403Z] STF 07:45:31.230 - o Process CO ended with the expected exit code (0)
[2024-08-15T07:45:31.403Z] STF 07:45:31.230 -
[2024-08-15T07:45:31.403Z] STF 07:45:31.230 - +------ Step 7 - Check output
[2024-08-15T07:45:31.403Z] STF 07:45:31.230 - | Count file matches
[2024-08-15T07:45:31.403Z] STF 07:45:31.230 - | TargetFile: /home/jenkins/workspace/Test_openjdk17_hs_sanity.system_x86-64_alpine-linux_testList_2/aqa-tests/TKG/output_17237078174752/PatMod_Adv_0/20240815-074527-PatModTest/results/combinedOT7.txt
[2024-08-15T07:45:31.403Z] STF 07:45:31.230 - | ExpectedNumMatches: 1
[2024-08-15T07:45:31.403Z] STF 07:45:31.230 - | SearchStrings: ["java.lang.ExceptionInInitializerError"]
[2024-08-15T07:45:31.403Z] STF 07:45:31.230 - |
[2024-08-15T07:45:31.403Z] STF 07:45:31.230 - Found 1 instances of ["java.lang.ExceptionInInitializerError"]
[2024-08-15T07:45:31.403Z] STF 07:45:31.230 -
[2024-08-15T07:45:31.403Z] STF 07:45:31.230 - +------ Step 8 - (Negative test) Verify if --patch-module allows replacing of module-info.class
[2024-08-15T07:45:31.403Z] STF 07:45:31.230 - | Run foreground process
[2024-08-15T07:45:31.403Z] STF 07:45:31.230 - | Program: /home/jenkins/workspace/Test_openjdk17_hs_sanity.system_x86-64_alpine-linux_testList_2/jdkbinary/j2sdk-image/bin/java
[2024-08-15T07:45:31.403Z] STF 07:45:31.230 - | Mnemonic: OT8
[2024-08-15T07:45:31.403Z] STF 07:45:31.230 - | Echo: ECHO_ON
[2024-08-15T07:45:31.403Z] STF 07:45:31.230 - | Expectation: NON_ZERO_EXIT [1] within 1m
[2024-08-15T07:45:31.403Z] STF 07:45:31.230 - |
[2024-08-15T07:45:31.403Z] STF 07:45:31.231 - Running command: /home/jenkins/workspace/Test_openjdk17_hs_sanity.system_x86-64_alpine-linux_testList_2/jdkbinary/j2sdk-image/bin/java --add-reads com.test=ALL-UNNAMED --module-path /home/jenkins/workspace/Test_openjdk17_hs_sanity.system_x86-64_alpine-linux_testList_2/jvmtest/system/aqa-systemtest/openjdk.test.modularity/bin/common-mods:/home/jenkins/workspace/Test_openjdk17_hs_sanity.system_x86-64_alpine-linux_testList_2/jvmtest/system/aqa-systemtest/openjdk.test.modularity/bin/tests --add-modules=com.test --patch-module com.hello=/home/jenkins/workspace/Test_openjdk17_hs_sanity.system_x86-64_alpine-linux_testList_2/jvmtest/system/aqa-systemtest/openjdk.test.modularity/bin/common-override-new/com.hello -XX:+UseCompressedOops -classpath /home/jenkins/testDependency/system_lib/junit/junit.jar:/home/jenkins/testDependency/system_lib/junit/hamcrest-core.jar org.junit.runner.JUnitCore net.adoptopenjdk.test.modularity.junit.TestOverrideUsingUnexportedPublicType
[2024-08-15T07:45:31.403Z] STF 07:45:31.231 - Redirecting stderr to /home/jenkins/workspace/Test_openjdk17_hs_sanity.system_x86-64_alpine-linux_testList_2/aqa-tests/TKG/output_17237078174752/PatMod_Adv_0/20240815-074527-PatModTest/results/8.OT8.stderr
[2024-08-15T07:45:31.403Z] STF 07:45:31.231 - Redirecting stdout to /home/jenkins/workspace/Test_openjdk17_hs_sanity.system_x86-64_alpine-linux_testList_2/aqa-tests/TKG/output_17237078174752/PatMod_Adv_0/20240815-074527-PatModTest/results/8.OT8.stdout
[2024-08-15T07:45:31.403Z] STF 07:45:31.236 - Monitoring processes: OT8
[2024-08-15T07:45:32.203Z] OT8 stderr WARNING: module-info.class ignored in patch: /home/jenkins/workspace/Test_openjdk17_hs_sanity.system_x86-64_alpine-linux_testList_2/jvmtest/system/aqa-systemtest/openjdk.test.modularity/bin/common-override-new/com.hello
[2024-08-15T07:45:32.203Z] OT8 JUnit version 4.12
[2024-08-15T07:45:32.203Z] OT8 .E
[2024-08-15T07:45:32.203Z] OT8 Time: 0.012
[2024-08-15T07:45:32.203Z] OT8 There was 1 failure:
[2024-08-15T07:45:32.203Z] OT8 1) testPatchingOfNewClassInExistingPackage(net.adoptopenjdk.test.modularity.junit.TestOverrideUsingUnexportedPublicType)
[2024-08-15T07:45:32.203Z] OT8 java.lang.IllegalAccessException: class net.adoptopenjdk.test.modularity.junit.TestOverrideUsingUnexportedPublicType (in module com.test) cannot access class adoptopenjdk.test.modularity.newpkg.NewClass2 (in module com.hello) because module com.hello does not export adoptopenjdk.test.modularity.newpkg to module com.test
[2024-08-15T07:45:32.203Z] OT8 at java.base/jdk.internal.reflect.Reflection.newIllegalAccessException(Reflection.java:392)
[2024-08-15T07:45:32.203Z] OT8 at java.base/java.lang.reflect.AccessibleObject.checkAccess(AccessibleObject.java:674)
[2024-08-15T07:45:32.203Z] OT8 at java.base/java.lang.reflect.Constructor.newInstanceWithCaller(Constructor.java:490)
[2024-08-15T07:45:32.203Z] OT8 at java.base/java.lang.reflect.Constructor.newInstance(Constructor.java:481)
[2024-08-15T07:45:32.203Z] OT8 at com.test/net.adoptopenjdk.test.modularity.junit.TestOverrideUsingUnexportedPublicType.testPatchingOfNewClassInExistingPackage(TestOverrideUsingUnexportedPublicType.java:34)
[2024-08-15T07:45:32.203Z] OT8 at java.base/jdk.internal.reflect.NativeMethodAccessorImpl.invoke0(Native Method)
[2024-08-15T07:45:32.204Z] OT8 at java.base/jdk.internal.reflect.NativeMethodAccessorImpl.invoke(NativeMethodAccessorImpl.java:77)
[2024-08-15T07:45:32.204Z] OT8 at java.base/jdk.internal.reflect.DelegatingMethodAccessorImpl.invoke(DelegatingMethodAccessorImpl.java:43)
[2024-08-15T07:45:32.204Z] OT8 at java.base/java.lang.reflect.Method.invoke(Method.java:569)
[2024-08-15T07:45:32.204Z] OT8 at org.junit.runners.model.FrameworkMethod$1.runReflectiveCall(FrameworkMethod.java:50)
[2024-08-15T07:45:32.204Z] OT8 at org.junit.internal.runners.model.ReflectiveCallable.run(ReflectiveCallable.java:12)
[2024-08-15T07:45:32.204Z] OT8 at org.junit.runners.model.FrameworkMethod.invokeExplosively(FrameworkMethod.java:47)
[2024-08-15T07:45:32.204Z] OT8 at org.junit.internal.runners.statements.InvokeMethod.evaluate(InvokeMethod.java:17)
[2024-08-15T07:45:32.204Z] OT8 at org.junit.runners.ParentRunner.runLeaf(ParentRunner.java:325)
[2024-08-15T07:45:32.204Z] OT8 at org.junit.runners.BlockJUnit4ClassRunner.runChild(BlockJUnit4ClassRunner.java:78)
[2024-08-15T07:45:32.204Z] OT8 at org.junit.runners.BlockJUnit4ClassRunner.runChild(BlockJUnit4ClassRunner.java:57)
[2024-08-15T07:45:32.204Z] OT8 at org.junit.runners.ParentRunner$3.run(ParentRunner.java:290)
[2024-08-15T07:45:32.204Z] OT8 at org.junit.runners.ParentRunner$1.schedule(ParentRunner.java:71)
[2024-08-15T07:45:32.204Z] OT8 at org.junit.runners.ParentRunner.runChildren(ParentRunner.java:288)
[2024-08-15T07:45:32.204Z] OT8 at org.junit.runners.ParentRunner.access$000(ParentRunner.java:58)
[2024-08-15T07:45:32.204Z] OT8 at org.junit.runners.ParentRunner$2.evaluate(ParentRunner.java:268)
[2024-08-15T07:45:32.204Z] OT8 at org.junit.runners.ParentRunner.run(ParentRunner.java:363)
[2024-08-15T07:45:32.204Z] OT8 at org.junit.runners.Suite.runChild(Suite.java:128)
[2024-08-15T07:45:32.204Z] OT8 at org.junit.runners.Suite.runChild(Suite.java:27)
[2024-08-15T07:45:32.204Z] OT8 at org.junit.runners.ParentRunner$3.run(ParentRunner.java:290)
[2024-08-15T07:45:32.204Z] OT8 at org.junit.runners.ParentRunner$1.schedule(ParentRunner.java:71)
[2024-08-15T07:45:32.204Z] OT8 at org.junit.runners.ParentRunner.runChildren(ParentRunner.java:288)
[2024-08-15T07:45:32.204Z] OT8 at org.junit.runners.ParentRunner.access$000(ParentRunner.java:58)
[2024-08-15T07:45:32.204Z] OT8 at org.junit.runners.ParentRunner$2.evaluate(ParentRunner.java:268)
[2024-08-15T07:45:32.204Z] OT8 at org.junit.runners.ParentRunner.run(ParentRunner.java:363)
[2024-08-15T07:45:32.204Z] OT8 at org.junit.runner.JUnitCore.run(JUnitCore.java:137)
[2024-08-15T07:45:32.204Z] OT8 at org.junit.runner.JUnitCore.run(JUnitCore.java:115)
[2024-08-15T07:45:32.204Z] OT8 at org.junit.runner.JUnitCore.runMain(JUnitCore.java:77)
[2024-08-15T07:45:32.204Z] OT8 at org.junit.runner.JUnitCore.main(JUnitCore.java:36)
[2024-08-15T07:45:32.204Z] OT8
[2024-08-15T07:45:32.204Z] OT8 FAILURES!!!
[2024-08-15T07:45:32.204Z] OT8 Tests run: 1, Failures: 1
[2024-08-15T07:45:32.204Z] OT8
[2024-08-15T07:45:32.204Z] STF 07:45:31.768 - Monitoring Report Summary:
[2024-08-15T07:45:32.204Z] STF 07:45:31.769 - o Process OT8 ended with the expected exit code (1)
[2024-08-15T07:45:32.204Z] STF 07:45:31.770 -
[2024-08-15T07:45:32.204Z] STF 07:45:31.770 - +------ Step 9 - Check output
[2024-08-15T07:45:32.204Z] STF 07:45:31.770 - | Count file matches
[2024-08-15T07:45:32.204Z] STF 07:45:31.770 - | TargetFile: /home/jenkins/workspace/Test_openjdk17_hs_sanity.system_x86-64_alpine-linux_testList_2/aqa-tests/TKG/output_17237078174752/PatMod_Adv_0/20240815-074527-PatModTest/results/8.OT8.stdout
[2024-08-15T07:45:32.204Z] STF 07:45:31.770 - | ExpectedNumMatches: 1
[2024-08-15T07:45:32.204Z] STF 07:45:31.770 - | SearchStrings: ["java.lang.IllegalAccessException"]
[2024-08-15T07:45:32.204Z] STF 07:45:31.770 - |
[2024-08-15T07:45:32.204Z] STF 07:45:31.770 - Found 1 instances of ["java.lang.IllegalAccessException"]
[2024-08-15T07:45:32.204Z] STF 07:45:31.770 - EXECUTE stage completed
[2024-08-15T07:45:32.204Z] STF 07:45:31.793 -
[2024-08-15T07:45:32.204Z] STF 07:45:31.796 - ==================== T E A R D O W N ====================
[2024-08-15T07:45:32.204Z] STF 07:45:31.796 - Running teardown: perl /home/jenkins/workspace/Test_openjdk17_hs_sanity.system_x86-64_alpine-linux_testList_2/aqa-tests/TKG/../TKG/output_17237078174752/PatMod_Adv_0/20240815-074527-PatModTest/tearDown.pl
[2024-08-15T07:45:32.204Z] STF 07:45:31.882 - TEARDOWN stage completed
[2024-08-15T07:45:32.204Z] STF 07:45:31.886 -
[2024-08-15T07:45:32.204Z] STF 07:45:31.886 - ===================== R E S U L T S =====================
[2024-08-15T07:45:32.204Z] STF 07:45:31.886 - Stage results:
[2024-08-15T07:45:32.204Z] STF 07:45:31.886 - setUp: pass
[2024-08-15T07:45:32.204Z] STF 07:45:31.886 - execute: pass
[2024-08-15T07:45:32.204Z] STF 07:45:31.886 - teardown: pass
[2024-08-15T07:45:32.204Z] STF 07:45:31.886 -
[2024-08-15T07:45:32.204Z] STF 07:45:31.886 - Overall result: PASSED
[2024-08-15T07:45:32.204Z] -----------------------------------
[2024-08-15T07:45:32.205Z] PatMod_Adv_0_PASSED
[2024-08-15T07:45:32.205Z] -----------------------------------
[2024-08-15T07:45:32.205Z]
[2024-08-15T07:45:32.205Z] TEST TEARDOWN:
[2024-08-15T07:45:32.205Z] Nothing to be done for teardown.
[2024-08-15T07:45:32.205Z] PatMod_Adv_0 Finish Time: Thu Aug 15 07:45:31 2024 Epoch Time (ms): 1723707931908