jdk_nio_1
[2024-08-28T20:49:57.341Z] Running test jdk_nio_1 ...
[2024-08-28T20:49:57.341Z] ===============================================
[2024-08-28T20:49:57.341Z] jdk_nio_1 Start Time: Wed Aug 28 16:49:56 2024 Epoch Time (ms): 1724878196925
[2024-08-28T20:49:57.341Z] variation: Mode650
[2024-08-28T20:49:57.341Z] JVM_OPTIONS: -XX:-UseCompressedOops
[2024-08-28T20:49:57.341Z] { \
[2024-08-28T20:49:57.341Z] echo ""; echo "TEST SETUP:"; \
[2024-08-28T20:49:57.341Z] echo "Nothing to be done for setup."; \
[2024-08-28T20:49:57.341Z] mkdir -p "/Users/admin/workspace/workspace/Test_openjdk17_hs_extended.openjdk_aarch64_mac_testList_1/aqa-tests/TKG/../TKG/output_17248769336214/jdk_nio_1"; \
[2024-08-28T20:49:57.341Z] cd "/Users/admin/workspace/workspace/Test_openjdk17_hs_extended.openjdk_aarch64_mac_testList_1/aqa-tests/TKG/../TKG/output_17248769336214/jdk_nio_1"; \
[2024-08-28T20:49:57.341Z] echo ""; echo "TESTING:"; \
[2024-08-28T20:49:57.341Z] "/Users/admin/workspace/workspace/Test_openjdk17_hs_extended.openjdk_aarch64_mac_testList_1/jdkbinary/j2sdk-image/Contents/Home/bin/..//bin/java" -Xmx512m -jar "/Users/admin/workspace/workspace/Test_openjdk17_hs_extended.openjdk_aarch64_mac_testList_1/aqa-tests/TKG/../../jvmtest/openjdk/jtreg/lib/jtreg.jar" \
[2024-08-28T20:49:57.341Z] -agentvm -a -ea -esa -v:fail,error,time,nopass -retain:fail,error,*.dmp,javacore.*,heapdump.*,*.trc -ignore:quiet -timeoutFactor:8 -xml:verify -concurrency:2 -nativepath:"/Users/admin/workspace/workspace/Test_openjdk17_hs_extended.openjdk_aarch64_mac_testList_1/jdkbinary/openjdk-test-image/jdk/jtreg/native" -vmoptions:"-Xmx512m -XX:-UseCompressedOops " \
[2024-08-28T20:49:57.341Z] -w ""/Users/admin/workspace/workspace/Test_openjdk17_hs_extended.openjdk_aarch64_mac_testList_1/aqa-tests/TKG/../TKG/output_17248769336214/jdk_nio_1"/work" \
[2024-08-28T20:49:57.341Z] -r ""/Users/admin/workspace/workspace/Test_openjdk17_hs_extended.openjdk_aarch64_mac_testList_1/aqa-tests/TKG/../TKG/output_17248769336214/jdk_nio_1"/report" \
[2024-08-28T20:49:57.341Z] -jdk:"/Users/admin/workspace/workspace/Test_openjdk17_hs_extended.openjdk_aarch64_mac_testList_1/jdkbinary/j2sdk-image/Contents/Home/bin/../" \
[2024-08-28T20:49:57.341Z] -exclude:"/Users/admin/workspace/workspace/Test_openjdk17_hs_extended.openjdk_aarch64_mac_testList_1/aqa-tests/TKG/../openjdk/openjdk-jdk/test/jdk/ProblemList.txt" \
[2024-08-28T20:49:57.341Z] -exclude:"/Users/admin/workspace/workspace/Test_openjdk17_hs_extended.openjdk_aarch64_mac_testList_1/aqa-tests/TKG/../../jvmtest/openjdk/excludes/ProblemList_openjdk17.txt" \
[2024-08-28T20:49:57.341Z] \
[2024-08-28T20:49:57.341Z] -exclude:"/Users/admin/workspace/workspace/Test_openjdk17_hs_extended.openjdk_aarch64_mac_testList_1/aqa-tests/TKG/../openjdk/excludes/vendors/eclipse/ProblemList_openjdk17.txt" \
[2024-08-28T20:49:57.341Z] "/Users/admin/workspace/workspace/Test_openjdk17_hs_extended.openjdk_aarch64_mac_testList_1/aqa-tests/TKG/../openjdk/openjdk-jdk/test/jdk:jdk_nio"; \
[2024-08-28T20:49:57.341Z] if [ $? -eq 0 ]; then echo "-----------------------------------"; echo "jdk_nio_1""_PASSED"; echo "-----------------------------------"; cd /Users/admin/workspace/workspace/Test_openjdk17_hs_extended.openjdk_aarch64_mac_testList_1/aqa-tests/TKG/..; else echo "-----------------------------------"; echo "jdk_nio_1""_FAILED"; echo "-----------------------------------"; fi; \
[2024-08-28T20:49:57.341Z] echo ""; echo "TEST TEARDOWN:"; \
[2024-08-28T20:49:57.341Z] echo "Nothing to be done for teardown."; \
[2024-08-28T20:49:57.341Z] } 2>&1 | tee -a "/Users/admin/workspace/workspace/Test_openjdk17_hs_extended.openjdk_aarch64_mac_testList_1/aqa-tests/TKG/../TKG/output_17248769336214/TestTargetResult";
[2024-08-28T20:49:57.341Z]
[2024-08-28T20:49:57.341Z] TEST SETUP:
[2024-08-28T20:49:57.341Z] Nothing to be done for setup.
[2024-08-28T20:49:57.341Z]
[2024-08-28T20:49:57.341Z] TESTING:
[2024-08-28T20:49:57.341Z] Directory "/Users/admin/workspace/workspace/Test_openjdk17_hs_extended.openjdk_aarch64_mac_testList_1/aqa-tests/TKG/../TKG/output_17248769336214/jdk_nio_1/work" not found: creating
[2024-08-28T20:49:57.342Z] Directory "/Users/admin/workspace/workspace/Test_openjdk17_hs_extended.openjdk_aarch64_mac_testList_1/aqa-tests/TKG/../TKG/output_17248769336214/jdk_nio_1/report" not found: creating
[2024-08-28T20:49:59.119Z] XML output with verification to /Users/admin/workspace/workspace/Test_openjdk17_hs_extended.openjdk_aarch64_mac_testList_1/aqa-tests/TKG/output_17248769336214/jdk_nio_1/work
[2024-08-28T20:51:23.011Z] --------------------------------------------------
[2024-08-28T20:51:23.011Z] TEST: java/nio/channels/DatagramChannel/Disconnect.java
[2024-08-28T20:51:23.011Z] TEST JDK: /Users/admin/workspace/workspace/Test_openjdk17_hs_extended.openjdk_aarch64_mac_testList_1/jdkbinary/j2sdk-image/Contents/Home/bin/..
[2024-08-28T20:51:23.011Z]
[2024-08-28T20:51:23.011Z] ACTION: build -- Failed. Compilation failed: Compilation failed
[2024-08-28T20:51:23.011Z] REASON: Named class compiled on demand
[2024-08-28T20:51:23.011Z] TIME: 0.018 seconds
[2024-08-28T20:51:23.011Z] messages:
[2024-08-28T20:51:23.011Z] command: build Disconnect
[2024-08-28T20:51:23.011Z] reason: Named class compiled on demand
[2024-08-28T20:51:23.011Z] started: Wed Aug 28 16:51:09 EDT 2024
[2024-08-28T20:51:23.011Z] Test directory:
[2024-08-28T20:51:23.011Z] compile: Disconnect
[2024-08-28T20:51:23.011Z] finished: Wed Aug 28 16:51:09 EDT 2024
[2024-08-28T20:51:23.011Z] elapsed time (seconds): 0.018
[2024-08-28T20:51:23.011Z]
[2024-08-28T20:51:23.011Z] ACTION: compile -- Failed. Compilation failed: Compilation failed
[2024-08-28T20:51:23.011Z] REASON: .class file out of date or does not exist
[2024-08-28T20:51:23.011Z] TIME: 0.018 seconds
[2024-08-28T20:51:23.011Z] messages:
[2024-08-28T20:51:23.011Z] command: compile /Users/admin/workspace/workspace/Test_openjdk17_hs_extended.openjdk_aarch64_mac_testList_1/aqa-tests/openjdk/openjdk-jdk/test/jdk/java/nio/channels/DatagramChannel/Disconnect.java
[2024-08-28T20:51:23.011Z] reason: .class file out of date or does not exist
[2024-08-28T20:51:23.011Z] started: Wed Aug 28 16:51:09 EDT 2024
[2024-08-28T20:51:23.011Z] Mode: agentvm
[2024-08-28T20:51:23.011Z] Agent id: 1
[2024-08-28T20:51:23.011Z] finished: Wed Aug 28 16:51:09 EDT 2024
[2024-08-28T20:51:23.011Z] elapsed time (seconds): 0.018
[2024-08-28T20:51:23.011Z] configuration:
[2024-08-28T20:51:23.011Z] Boot Layer (javac runtime environment)
[2024-08-28T20:51:23.011Z] class path: /Users/admin/workspace/workspace/Test_openjdk17_hs_extended.openjdk_aarch64_mac_testList_1/jvmtest/openjdk/jtreg/lib/javatest.jar
[2024-08-28T20:51:23.012Z] /Users/admin/workspace/workspace/Test_openjdk17_hs_extended.openjdk_aarch64_mac_testList_1/jvmtest/openjdk/jtreg/lib/jtreg.jar
[2024-08-28T20:51:23.012Z] patch: java.base /Users/admin/workspace/workspace/Test_openjdk17_hs_extended.openjdk_aarch64_mac_testList_1/aqa-tests/TKG/output_17248769336214/jdk_nio_1/work/patches/java.base
[2024-08-28T20:51:23.012Z]
[2024-08-28T20:51:23.012Z] javac compilation environment
[2024-08-28T20:51:23.012Z] source path: /Users/admin/workspace/workspace/Test_openjdk17_hs_extended.openjdk_aarch64_mac_testList_1/aqa-tests/openjdk/openjdk-jdk/test/jdk/java/nio/channels/DatagramChannel
[2024-08-28T20:51:23.012Z] /Users/admin/workspace/workspace/Test_openjdk17_hs_extended.openjdk_aarch64_mac_testList_1/aqa-tests/openjdk/openjdk-jdk/test/lib
[2024-08-28T20:51:23.012Z] class path: /Users/admin/workspace/workspace/Test_openjdk17_hs_extended.openjdk_aarch64_mac_testList_1/aqa-tests/openjdk/openjdk-jdk/test/jdk/java/nio/channels/DatagramChannel
[2024-08-28T20:51:23.012Z] /Users/admin/workspace/workspace/Test_openjdk17_hs_extended.openjdk_aarch64_mac_testList_1/aqa-tests/TKG/output_17248769336214/jdk_nio_1/work/classes/1/java/nio/channels/DatagramChannel/Disconnect.d
[2024-08-28T20:51:23.012Z] /Users/admin/workspace/workspace/Test_openjdk17_hs_extended.openjdk_aarch64_mac_testList_1/aqa-tests/TKG/output_17248769336214/jdk_nio_1/work/classes/1/test/lib
[2024-08-28T20:51:23.012Z]
[2024-08-28T20:51:23.012Z] rerun:
[2024-08-28T20:51:23.012Z] cd /Users/admin/workspace/workspace/Test_openjdk17_hs_extended.openjdk_aarch64_mac_testList_1/aqa-tests/TKG/output_17248769336214/jdk_nio_1/work/scratch/0 && \
[2024-08-28T20:51:23.012Z] HOME=/Users/admin \
[2024-08-28T20:51:23.012Z] PATH=/bin:/usr/bin:/usr/sbin \
[2024-08-28T20:51:23.012Z] /Users/admin/workspace/workspace/Test_openjdk17_hs_extended.openjdk_aarch64_mac_testList_1/jdkbinary/j2sdk-image/Contents/Home/bin/../bin/javac \
[2024-08-28T20:51:23.012Z] -J-ea \
[2024-08-28T20:51:23.012Z] -J-esa \
[2024-08-28T20:51:23.012Z] -J-Xmx512m \
[2024-08-28T20:51:23.012Z] -J-XX:-UseCompressedOops \
[2024-08-28T20:51:23.012Z] -J-Dtest.vm.opts='-ea -esa -Xmx512m -XX:-UseCompressedOops' \
[2024-08-28T20:51:23.012Z] -J-Dtest.tool.vm.opts='-J-ea -J-esa -J-Xmx512m -J-XX:-UseCompressedOops' \
[2024-08-28T20:51:23.012Z] -J-Dtest.compiler.opts= \
[2024-08-28T20:51:23.012Z] -J-Dtest.java.opts= \
[2024-08-28T20:51:23.012Z] -J-Dtest.jdk=/Users/admin/workspace/workspace/Test_openjdk17_hs_extended.openjdk_aarch64_mac_testList_1/jdkbinary/j2sdk-image/Contents/Home/bin/.. \
[2024-08-28T20:51:23.012Z] -J-Dcompile.jdk=/Users/admin/workspace/workspace/Test_openjdk17_hs_extended.openjdk_aarch64_mac_testList_1/jdkbinary/j2sdk-image/Contents/Home/bin/.. \
[2024-08-28T20:51:23.012Z] -J-Dtest.timeout.factor=8.0 \
[2024-08-28T20:51:23.012Z] -J-Dtest.nativepath=/Users/admin/workspace/workspace/Test_openjdk17_hs_extended.openjdk_aarch64_mac_testList_1/jdkbinary/openjdk-test-image/jdk/jtreg/native \
[2024-08-28T20:51:23.012Z] -J-Dtest.root=/Users/admin/workspace/workspace/Test_openjdk17_hs_extended.openjdk_aarch64_mac_testList_1/aqa-tests/openjdk/openjdk-jdk/test/jdk \
[2024-08-28T20:51:23.012Z] -J-Dtest.name=java/nio/channels/DatagramChannel/Disconnect.java \
[2024-08-28T20:51:23.012Z] -J-Dtest.file=/Users/admin/workspace/workspace/Test_openjdk17_hs_extended.openjdk_aarch64_mac_testList_1/aqa-tests/openjdk/openjdk-jdk/test/jdk/java/nio/channels/DatagramChannel/Disconnect.java \
[2024-08-28T20:51:23.012Z] -J-Dtest.src=/Users/admin/workspace/workspace/Test_openjdk17_hs_extended.openjdk_aarch64_mac_testList_1/aqa-tests/openjdk/openjdk-jdk/test/jdk/java/nio/channels/DatagramChannel \
[2024-08-28T20:51:23.012Z] -J-Dtest.src.path=/Users/admin/workspace/workspace/Test_openjdk17_hs_extended.openjdk_aarch64_mac_testList_1/aqa-tests/openjdk/openjdk-jdk/test/jdk/java/nio/channels/DatagramChannel:/Users/admin/workspace/workspace/Test_openjdk17_hs_extended.openjdk_aarch64_mac_testList_1/aqa-tests/openjdk/openjdk-jdk/test/lib \
[2024-08-28T20:51:23.012Z] -J-Dtest.classes=/Users/admin/workspace/workspace/Test_openjdk17_hs_extended.openjdk_aarch64_mac_testList_1/aqa-tests/TKG/output_17248769336214/jdk_nio_1/work/classes/1/java/nio/channels/DatagramChannel/Disconnect.d \
[2024-08-28T20:51:23.012Z] -J-Dtest.class.path=/Users/admin/workspace/workspace/Test_openjdk17_hs_extended.openjdk_aarch64_mac_testList_1/aqa-tests/TKG/output_17248769336214/jdk_nio_1/work/classes/1/java/nio/channels/DatagramChannel/Disconnect.d:/Users/admin/workspace/workspace/Test_openjdk17_hs_extended.openjdk_aarch64_mac_testList_1/aqa-tests/TKG/output_17248769336214/jdk_nio_1/work/classes/1/test/lib \
[2024-08-28T20:51:23.012Z] -J-Dtest.class.path.prefix=/Users/admin/workspace/workspace/Test_openjdk17_hs_extended.openjdk_aarch64_mac_testList_1/aqa-tests/TKG/output_17248769336214/jdk_nio_1/work/classes/1/java/nio/channels/DatagramChannel/Disconnect.d:/Users/admin/workspace/workspace/Test_openjdk17_hs_extended.openjdk_aarch64_mac_testList_1/aqa-tests/openjdk/openjdk-jdk/test/jdk/java/nio/channels/DatagramChannel:/Users/admin/workspace/workspace/Test_openjdk17_hs_extended.openjdk_aarch64_mac_testList_1/aqa-tests/TKG/output_17248769336214/jdk_nio_1/work/classes/1/test/lib \
[2024-08-28T20:51:23.012Z] -d /Users/admin/workspace/workspace/Test_openjdk17_hs_extended.openjdk_aarch64_mac_testList_1/aqa-tests/TKG/output_17248769336214/jdk_nio_1/work/classes/1/java/nio/channels/DatagramChannel/Disconnect.d \
[2024-08-28T20:51:23.012Z] -sourcepath /Users/admin/workspace/workspace/Test_openjdk17_hs_extended.openjdk_aarch64_mac_testList_1/aqa-tests/openjdk/openjdk-jdk/test/jdk/java/nio/channels/DatagramChannel:/Users/admin/workspace/workspace/Test_openjdk17_hs_extended.openjdk_aarch64_mac_testList_1/aqa-tests/openjdk/openjdk-jdk/test/lib \
[2024-08-28T20:51:23.012Z] -classpath /Users/admin/workspace/workspace/Test_openjdk17_hs_extended.openjdk_aarch64_mac_testList_1/aqa-tests/openjdk/openjdk-jdk/test/jdk/java/nio/channels/DatagramChannel:/Users/admin/workspace/workspace/Test_openjdk17_hs_extended.openjdk_aarch64_mac_testList_1/aqa-tests/TKG/output_17248769336214/jdk_nio_1/work/classes/1/java/nio/channels/DatagramChannel/Disconnect.d:/Users/admin/workspace/workspace/Test_openjdk17_hs_extended.openjdk_aarch64_mac_testList_1/aqa-tests/TKG/output_17248769336214/jdk_nio_1/work/classes/1/test/lib /Users/admin/workspace/workspace/Test_openjdk17_hs_extended.openjdk_aarch64_mac_testList_1/aqa-tests/openjdk/openjdk-jdk/test/jdk/java/nio/channels/DatagramChannel/Disconnect.java
[2024-08-28T20:51:23.012Z] direct:
[2024-08-28T20:51:23.012Z] /Users/admin/workspace/workspace/Test_openjdk17_hs_extended.openjdk_aarch64_mac_testList_1/aqa-tests/openjdk/openjdk-jdk/test/jdk/java/nio/channels/DatagramChannel/Disconnect.java:55: error: cannot find symbol
[2024-08-28T20:51:23.012Z] InetAddress lo4 = InetAddress.ofLiteral("127.0.0.1");
[2024-08-28T20:51:23.012Z] ^
[2024-08-28T20:51:23.012Z] symbol: method ofLiteral(String)
[2024-08-28T20:51:23.012Z] location: class InetAddress
[2024-08-28T20:51:23.012Z] /Users/admin/workspace/workspace/Test_openjdk17_hs_extended.openjdk_aarch64_mac_testList_1/aqa-tests/openjdk/openjdk-jdk/test/jdk/java/nio/channels/DatagramChannel/Disconnect.java:65: error: cannot find symbol
[2024-08-28T20:51:23.012Z] InetAddress lo6 = InetAddress.ofLiteral("::1");
[2024-08-28T20:51:23.012Z] ^
[2024-08-28T20:51:23.012Z] symbol: method ofLiteral(String)
[2024-08-28T20:51:23.012Z] location: class InetAddress
[2024-08-28T20:51:23.012Z] 2 errors
[2024-08-28T20:51:23.012Z]
[2024-08-28T20:51:23.012Z] TEST RESULT: Failed. Compilation failed: Compilation failed
[2024-08-28T20:51:23.012Z] --------------------------------------------------
[2024-08-28T20:57:33.925Z] Test results: passed: 440; failed: 1
[2024-08-28T20:57:38.946Z] Report written to /Users/admin/workspace/workspace/Test_openjdk17_hs_extended.openjdk_aarch64_mac_testList_1/aqa-tests/TKG/output_17248769336214/jdk_nio_1/report/html/report.html
[2024-08-28T20:57:38.946Z] Results written to /Users/admin/workspace/workspace/Test_openjdk17_hs_extended.openjdk_aarch64_mac_testList_1/aqa-tests/TKG/output_17248769336214/jdk_nio_1/work
[2024-08-28T20:57:38.946Z] Error: Some tests failed or other problems occurred.
[2024-08-28T20:57:38.946Z] -----------------------------------
[2024-08-28T20:57:38.946Z] jdk_nio_1_FAILED
[2024-08-28T20:57:38.946Z] -----------------------------------
[2024-08-28T20:57:38.946Z]
[2024-08-28T20:57:38.946Z] TEST TEARDOWN:
[2024-08-28T20:57:38.946Z] Nothing to be done for teardown.
[2024-08-28T20:57:38.946Z] jdk_nio_1 Finish Time: Wed Aug 28 16:57:38 2024 Epoch Time (ms): 1724878658347