PatMod_Adv_0
[2024-08-28T23:53:10.656Z] Running test PatMod_Adv_0 ...
[2024-08-28T23:53:10.656Z] ===============================================
[2024-08-28T23:53:10.656Z] PatMod_Adv_0 Start Time: Wed Aug 28 23:53:10 2024 Epoch Time (ms): 1724889190480
[2024-08-28T23:53:10.656Z] variation: Mode150
[2024-08-28T23:53:10.656Z] JVM_OPTIONS: -XX:+UseCompressedOops
[2024-08-28T23:53:10.656Z] { \
[2024-08-28T23:53:10.656Z] echo ""; echo "TEST SETUP:"; \
[2024-08-28T23:53:10.656Z] echo "Nothing to be done for setup."; \
[2024-08-28T23:53:10.656Z] mkdir -p "/home/jenkins/workspace/Test_openjdk11_hs_sanity.system_aarch64_linux_testList_2/aqa-tests/TKG/../TKG/output_1724887027922/PatMod_Adv_0"; \
[2024-08-28T23:53:10.656Z] cd "/home/jenkins/workspace/Test_openjdk11_hs_sanity.system_aarch64_linux_testList_2/aqa-tests/TKG/../TKG/output_1724887027922/PatMod_Adv_0"; \
[2024-08-28T23:53:10.657Z] echo ""; echo "TESTING:"; \
[2024-08-28T23:53:10.657Z] perl /home/jenkins/workspace/Test_openjdk11_hs_sanity.system_aarch64_linux_testList_2/aqa-tests/TKG/../../jvmtest/system/modularity/..//STF/stf.core/scripts/stf.pl -test-root="/home/jenkins/workspace/Test_openjdk11_hs_sanity.system_aarch64_linux_testList_2/aqa-tests/TKG/../../jvmtest/system/modularity/..//STF;/home/jenkins/workspace/Test_openjdk11_hs_sanity.system_aarch64_linux_testList_2/aqa-tests/TKG/../../jvmtest/system/modularity/..//aqa-systemtest""" -systemtest-prereqs="/home/jenkins/workspace/Test_openjdk11_hs_sanity.system_aarch64_linux_testList_2/../../testDependency/system_lib/" -java-args=' -XX:+UseCompressedOops ' -results-root="/home/jenkins/workspace/Test_openjdk11_hs_sanity.system_aarch64_linux_testList_2/aqa-tests/TKG/../TKG/output_1724887027922/PatMod_Adv_0" -test=PatModTest -test-args="variant=Adv"; \
[2024-08-28T23:53:10.657Z] if [ $? -eq 0 ]; then echo "-----------------------------------"; echo "PatMod_Adv_0""_PASSED"; echo "-----------------------------------"; cd /home/jenkins/workspace/Test_openjdk11_hs_sanity.system_aarch64_linux_testList_2/aqa-tests/TKG/..; rm -f -r "/home/jenkins/workspace/Test_openjdk11_hs_sanity.system_aarch64_linux_testList_2/aqa-tests/TKG/../TKG/output_1724887027922/PatMod_Adv_0"; else echo "-----------------------------------"; echo "PatMod_Adv_0""_FAILED"; echo "-----------------------------------"; fi; \
[2024-08-28T23:53:10.657Z] echo ""; echo "TEST TEARDOWN:"; \
[2024-08-28T23:53:10.657Z] echo "Nothing to be done for teardown."; \
[2024-08-28T23:53:10.657Z] } 2>&1 | tee -a "/home/jenkins/workspace/Test_openjdk11_hs_sanity.system_aarch64_linux_testList_2/aqa-tests/TKG/../TKG/output_1724887027922/TestTargetResult";
[2024-08-28T23:53:10.657Z]
[2024-08-28T23:53:10.657Z] TEST SETUP:
[2024-08-28T23:53:10.657Z] Nothing to be done for setup.
[2024-08-28T23:53:10.657Z]
[2024-08-28T23:53:10.657Z] TESTING:
[2024-08-28T23:53:11.461Z] STF 23:53:10.800 - ========================= S T F =========================
[2024-08-28T23:53:11.461Z] systemtest-prereqs has been processed, and set to: /home/jenkins/testDependency/system_libRetrieving amount of free space on drive containing /home/jenkins/workspace/Test_openjdk11_hs_sanity.system_aarch64_linux_testList_2/aqa-tests/TKG/../TKG/output_1724887027922/PatMod_Adv_0
[2024-08-28T23:53:11.461Z] There is 229765 Mb free
[2024-08-28T23:53:11.461Z] STF 23:53:10.827 - ================== G E N E R A T I O N ==================
[2024-08-28T23:53:11.461Z] STF 23:53:10.828 - Checking JVM: /home/jenkins/workspace/Test_openjdk11_hs_sanity.system_aarch64_linux_testList_2/jdkbinary/j2sdk-image
[2024-08-28T23:53:11.461Z] STF 23:53:10.828 - Starting process to generate scripts: /home/jenkins/workspace/Test_openjdk11_hs_sanity.system_aarch64_linux_testList_2/jdkbinary/j2sdk-image/bin/java -Dlog4j.skipJansi=true -Djava.system.class.loader=net.adoptopenjdk.stf.runner.StfClassLoader -classpath /home/jenkins/workspace/Test_openjdk11_hs_sanity.system_aarch64_linux_testList_2/../../testDependency/system_lib//log4j/log4j-api.jar:/home/jenkins/workspace/Test_openjdk11_hs_sanity.system_aarch64_linux_testList_2/../../testDependency/system_lib//log4j/log4j-core.jar:/home/jenkins/workspace/Test_openjdk11_hs_sanity.system_aarch64_linux_testList_2/jvmtest/system/STF/stf.core/scripts/../bin net.adoptopenjdk.stf.runner.StfRunner -properties "/home/jenkins/workspace/Test_openjdk11_hs_sanity.system_aarch64_linux_testList_2/aqa-tests/TKG/../TKG/output_1724887027922/PatMod_Adv_0/20240828-235310-PatModTest/stf_parameters.properties, , /home/jenkins/workspace/Test_openjdk11_hs_sanity.system_aarch64_linux_testList_2/jvmtest/system/STF/stf.core/config/stf.properties" -testDir "/home/jenkins/workspace/Test_openjdk11_hs_sanity.system_aarch64_linux_testList_2/aqa-tests/TKG/../TKG/output_1724887027922/PatMod_Adv_0/20240828-235310-PatModTest"
[2024-08-28T23:53:19.973Z] GEN 23:53:19.535 - Found test. Project: 'openjdk.test.modularity' class: 'PatModTest.class' Dir: '/home/jenkins/workspace/Test_openjdk11_hs_sanity.system_aarch64_linux_testList_2/jvmtest/system/aqa-systemtest/openjdk.test.modularity/bin'
[2024-08-28T23:53:19.973Z] GEN 23:53:19.767 - Found test. Project: 'openjdk.test.modularity' class: 'net.adoptopenjdk.test.modularity.PatModTest'
[2024-08-28T23:53:21.630Z] GEN Classpath directories used by project 'openjdk.test.modularity':
[2024-08-28T23:53:21.630Z] GEN /home/jenkins/workspace/Test_openjdk11_hs_sanity.system_aarch64_linux_testList_2/jvmtest/system/aqa-systemtest/openjdk.test.modularity/bin/common-mods/displayService
[2024-08-28T23:53:21.630Z] GEN /home/jenkins/workspace/Test_openjdk11_hs_sanity.system_aarch64_linux_testList_2/jvmtest/system/aqa-systemtest/openjdk.test.modularity/bin/common-mods/com.helper
[2024-08-28T23:53:21.630Z] GEN /home/jenkins/workspace/Test_openjdk11_hs_sanity.system_aarch64_linux_testList_2/jvmtest/system/aqa-systemtest/openjdk.test.modularity/bin/common-mods/displayServiceImpl1
[2024-08-28T23:53:21.630Z] GEN /home/jenkins/workspace/Test_openjdk11_hs_sanity.system_aarch64_linux_testList_2/jvmtest/system/aqa-systemtest/openjdk.test.modularity/bin/common-mods/com.discreet
[2024-08-28T23:53:21.630Z] GEN /home/jenkins/workspace/Test_openjdk11_hs_sanity.system_aarch64_linux_testList_2/jvmtest/system/aqa-systemtest/openjdk.test.modularity/bin/common-mods/com.hello
[2024-08-28T23:53:21.630Z] GEN /home/jenkins/workspace/Test_openjdk11_hs_sanity.system_aarch64_linux_testList_2/jvmtest/system/aqa-systemtest/openjdk.test.modularity/bin/common-mods/com.hola
[2024-08-28T23:53:21.630Z] GEN /home/jenkins/workspace/Test_openjdk11_hs_sanity.system_aarch64_linux_testList_2/jvmtest/system/aqa-systemtest/openjdk.test.modularity/bin/common-mods/displayServiceImpl2
[2024-08-28T23:53:21.630Z] GEN /home/jenkins/workspace/Test_openjdk11_hs_sanity.system_aarch64_linux_testList_2/jvmtest/system/aqa-systemtest/openjdk.test.modularity/bin/common-mods/com.hi
[2024-08-28T23:53:21.630Z] GEN /home/jenkins/workspace/Test_openjdk11_hs_sanity.system_aarch64_linux_testList_2/jvmtest/system/aqa-systemtest/openjdk.test.modularity/bin/common-override
[2024-08-28T23:53:21.630Z] GEN /home/jenkins/workspace/Test_openjdk11_hs_sanity.system_aarch64_linux_testList_2/jvmtest/system/aqa-systemtest/openjdk.test.modularity/bin/common-override-new
[2024-08-28T23:53:21.630Z] GEN /home/jenkins/workspace/Test_openjdk11_hs_sanity.system_aarch64_linux_testList_2/jvmtest/system/aqa-systemtest/openjdk.test.modularity/bin/common/displayServiceImpl3
[2024-08-28T23:53:21.630Z] GEN /home/jenkins/workspace/Test_openjdk11_hs_sanity.system_aarch64_linux_testList_2/jvmtest/system/aqa-systemtest/openjdk.test.modularity/bin/common/displayServiceImpl4
[2024-08-28T23:53:21.630Z] GEN /home/jenkins/workspace/Test_openjdk11_hs_sanity.system_aarch64_linux_testList_2/jvmtest/system/aqa-systemtest/openjdk.test.modularity/bin/common
[2024-08-28T23:53:21.630Z] GEN /home/jenkins/workspace/Test_openjdk11_hs_sanity.system_aarch64_linux_testList_2/jvmtest/system/aqa-systemtest/openjdk.test.modularity/bin/tests
[2024-08-28T23:53:21.630Z] GEN /home/jenkins/workspace/Test_openjdk11_hs_sanity.system_aarch64_linux_testList_2/jvmtest/system/aqa-systemtest/openjdk.test.modularity/bin
[2024-08-28T23:53:21.630Z] GEN /home/jenkins/workspace/Test_openjdk11_hs_sanity.system_aarch64_linux_testList_2/jvmtest/system/STF/stf.core/bin
[2024-08-28T23:53:21.630Z] GEN /home/jenkins/testDependency/system_lib/log4j/log4j-api.jar
[2024-08-28T23:53:21.630Z] GEN /home/jenkins/testDependency/system_lib/log4j/log4j-core.jar
[2024-08-28T23:53:21.630Z] GEN /home/jenkins/testDependency/system_lib/junit/junit.jar
[2024-08-28T23:53:22.458Z] GEN 23:53:21.830 - Using Mode NoOptions. Values = ''
[2024-08-28T23:53:24.140Z] GEN 23:53:23.384 -
[2024-08-28T23:53:24.140Z] GEN 23:53:23.384 - Test command summary:
[2024-08-28T23:53:24.140Z] GEN 23:53:23.385 - Step Stage Command Description
[2024-08-28T23:53:24.140Z] GEN 23:53:23.385 - -----+--------+-----------------+------------
[2024-08-28T23:53:24.140Z] GEN 23:53:23.385 - 1 execute jar Create com.hello jar
[2024-08-28T23:53:24.141Z] GEN 23:53:23.385 - 2 execute jar Create com.discreet jar
[2024-08-28T23:53:24.141Z] GEN 23:53:23.385 - 3 execute jar create java.xml.jar
[2024-08-28T23:53:24.141Z] GEN 23:53:23.401 - 4 execute Run java Run application class override test where we specify two exploded module paths in a single --patch-module option
[2024-08-28T23:53:24.141Z] GEN 23:53:23.402 - 5 execute Run java (Negative test) Verify if a module can be specified only once on --patch-module
[2024-08-28T23:53:24.141Z] GEN 23:53:23.402 - 6 execute Run java Combine stderr and stdout files of process OT7
[2024-08-28T23:53:24.141Z] GEN 23:53:23.402 - 7 execute count Check output
[2024-08-28T23:53:24.141Z] GEN 23:53:23.402 - 8 execute Run java (Negative test) Verify if --patch-module allows replacing of module-info.class
[2024-08-28T23:53:24.141Z] GEN 23:53:23.402 - 9 execute count Check output
[2024-08-28T23:53:24.141Z] STF 23:53:23.845 -
[2024-08-28T23:53:24.141Z] STF 23:53:23.845 - Script generation completed
[2024-08-28T23:53:24.141Z] STF 23:53:23.845 -
[2024-08-28T23:53:24.141Z] STF 23:53:23.845 -
[2024-08-28T23:53:24.141Z] STF 23:53:23.846 - ======================= S E T U P =======================
[2024-08-28T23:53:24.141Z] STF 23:53:23.846 - Running setup: perl /home/jenkins/workspace/Test_openjdk11_hs_sanity.system_aarch64_linux_testList_2/aqa-tests/TKG/../TKG/output_1724887027922/PatMod_Adv_0/20240828-235310-PatModTest/setUp.pl
[2024-08-28T23:53:24.946Z] STF 23:53:24.117 - SETUP stage completed
[2024-08-28T23:53:24.946Z] STF 23:53:24.134 -
[2024-08-28T23:53:24.946Z] STF 23:53:24.134 - ==================== E X E C U T E - ====================
[2024-08-28T23:53:24.946Z] STF 23:53:24.135 - Running execute: perl /home/jenkins/workspace/Test_openjdk11_hs_sanity.system_aarch64_linux_testList_2/aqa-tests/TKG/../TKG/output_1724887027922/PatMod_Adv_0/20240828-235310-PatModTest/execute.pl
[2024-08-28T23:53:24.946Z] STF 23:53:24.453 -
[2024-08-28T23:53:24.946Z] STF 23:53:24.453 - Java version
[2024-08-28T23:53:24.946Z] STF 23:53:24.454 - Running: /home/jenkins/workspace/Test_openjdk11_hs_sanity.system_aarch64_linux_testList_2/jdkbinary/j2sdk-image/bin/java -version
[2024-08-28T23:53:25.751Z] openjdk version "11.0.25-beta" 2024-10-15
[2024-08-28T23:53:25.751Z] OpenJDK Runtime Environment Temurin-11.0.25+5-202408282003 (build 11.0.25-beta+5-ea)
[2024-08-28T23:53:25.751Z] OpenJDK 64-Bit Server VM Temurin-11.0.25+5-202408282003 (build 11.0.25-beta+5-ea, mixed mode)
[2024-08-28T23:53:25.751Z] STF 23:53:25.099 -
[2024-08-28T23:53:25.751Z] STF 23:53:25.099 - +------ Step 1 - Create com.hello jar
[2024-08-28T23:53:25.751Z] STF 23:53:25.099 - | Create modular jar
[2024-08-28T23:53:25.751Z] STF 23:53:25.099 - | ModuleSpec: openjdk.test.modularity/bin/common-override/com.hello
[2024-08-28T23:53:25.751Z] STF 23:53:25.099 - | ModuleVersion: null
[2024-08-28T23:53:25.751Z] STF 23:53:25.099 - | MainClass: null
[2024-08-28T23:53:25.751Z] STF 23:53:25.104 - | HashModules: null
[2024-08-28T23:53:25.751Z] STF 23:53:25.104 - |
[2024-08-28T23:53:25.751Z] STF 23:53:25.105 - Running command: /home/jenkins/workspace/Test_openjdk11_hs_sanity.system_aarch64_linux_testList_2/jdkbinary/j2sdk-image/bin/jar --create --file /home/jenkins/workspace/Test_openjdk11_hs_sanity.system_aarch64_linux_testList_2/aqa-tests/TKG/output_1724887027922/PatMod_Adv_0/20240828-235310-PatModTest/modules/1.com.hello.jar -C /home/jenkins/workspace/Test_openjdk11_hs_sanity.system_aarch64_linux_testList_2/jvmtest/system/aqa-systemtest/openjdk.test.modularity/bin/common-override/com.hello .
[2024-08-28T23:53:25.751Z] STF 23:53:25.105 - Redirecting stderr to /home/jenkins/workspace/Test_openjdk11_hs_sanity.system_aarch64_linux_testList_2/aqa-tests/TKG/output_1724887027922/PatMod_Adv_0/20240828-235310-PatModTest/results/1.CMJ.stderr
[2024-08-28T23:53:25.751Z] STF 23:53:25.105 - Redirecting stdout to /home/jenkins/workspace/Test_openjdk11_hs_sanity.system_aarch64_linux_testList_2/aqa-tests/TKG/output_1724887027922/PatMod_Adv_0/20240828-235310-PatModTest/results/1.CMJ.stdout
[2024-08-28T23:53:25.751Z] STF 23:53:25.171 - Monitoring processes: CMJ
[2024-08-28T23:53:27.442Z] STF 23:53:26.786 - Monitoring Report Summary:
[2024-08-28T23:53:27.443Z] STF 23:53:26.786 - o Process CMJ ended with the expected exit code (0)
[2024-08-28T23:53:27.443Z] STF 23:53:26.787 - Created modular jar: 1.com.hello.jar
[2024-08-28T23:53:27.443Z] STF 23:53:26.787 -
[2024-08-28T23:53:27.443Z] STF 23:53:26.787 - +------ Step 2 - Create com.discreet jar
[2024-08-28T23:53:27.443Z] STF 23:53:26.787 - | Create modular jar
[2024-08-28T23:53:27.443Z] STF 23:53:26.787 - | ModuleSpec: openjdk.test.modularity/bin/common-override/com.discreet
[2024-08-28T23:53:27.443Z] STF 23:53:26.787 - | ModuleVersion: null
[2024-08-28T23:53:27.443Z] STF 23:53:26.787 - | MainClass: null
[2024-08-28T23:53:27.443Z] STF 23:53:26.787 - | HashModules: null
[2024-08-28T23:53:27.443Z] STF 23:53:26.787 - |
[2024-08-28T23:53:27.443Z] STF 23:53:26.787 - Running command: /home/jenkins/workspace/Test_openjdk11_hs_sanity.system_aarch64_linux_testList_2/jdkbinary/j2sdk-image/bin/jar --create --file /home/jenkins/workspace/Test_openjdk11_hs_sanity.system_aarch64_linux_testList_2/aqa-tests/TKG/output_1724887027922/PatMod_Adv_0/20240828-235310-PatModTest/modules/2.com.discreet.jar -C /home/jenkins/workspace/Test_openjdk11_hs_sanity.system_aarch64_linux_testList_2/jvmtest/system/aqa-systemtest/openjdk.test.modularity/bin/common-override/com.discreet .
[2024-08-28T23:53:27.443Z] STF 23:53:26.787 - Redirecting stderr to /home/jenkins/workspace/Test_openjdk11_hs_sanity.system_aarch64_linux_testList_2/aqa-tests/TKG/output_1724887027922/PatMod_Adv_0/20240828-235310-PatModTest/results/2.CMJ.stderr
[2024-08-28T23:53:27.443Z] STF 23:53:26.787 - Redirecting stdout to /home/jenkins/workspace/Test_openjdk11_hs_sanity.system_aarch64_linux_testList_2/aqa-tests/TKG/output_1724887027922/PatMod_Adv_0/20240828-235310-PatModTest/results/2.CMJ.stdout
[2024-08-28T23:53:27.443Z] STF 23:53:26.804 - Monitoring processes: CMJ
[2024-08-28T23:53:29.090Z] STF 23:53:28.193 - Monitoring Report Summary:
[2024-08-28T23:53:29.090Z] STF 23:53:28.196 - o Process CMJ ended with the expected exit code (0)
[2024-08-28T23:53:29.090Z] STF 23:53:28.197 - Created modular jar: 2.com.discreet.jar
[2024-08-28T23:53:29.090Z] STF 23:53:28.197 -
[2024-08-28T23:53:29.090Z] STF 23:53:28.197 - +------ Step 3 - create java.xml.jar
[2024-08-28T23:53:29.090Z] STF 23:53:28.197 - | Create modular jar
[2024-08-28T23:53:29.090Z] STF 23:53:28.197 - | ModuleSpec: openjdk.test.modularity/bin/common-override/java.xml
[2024-08-28T23:53:29.090Z] STF 23:53:28.197 - | ModuleVersion: null
[2024-08-28T23:53:29.090Z] STF 23:53:28.197 - | MainClass: null
[2024-08-28T23:53:29.090Z] STF 23:53:28.197 - | HashModules: null
[2024-08-28T23:53:29.090Z] STF 23:53:28.197 - |
[2024-08-28T23:53:29.090Z] STF 23:53:28.197 - Running command: /home/jenkins/workspace/Test_openjdk11_hs_sanity.system_aarch64_linux_testList_2/jdkbinary/j2sdk-image/bin/jar --create --file /home/jenkins/workspace/Test_openjdk11_hs_sanity.system_aarch64_linux_testList_2/aqa-tests/TKG/output_1724887027922/PatMod_Adv_0/20240828-235310-PatModTest/modules/3.java.xml.jar -C /home/jenkins/workspace/Test_openjdk11_hs_sanity.system_aarch64_linux_testList_2/jvmtest/system/aqa-systemtest/openjdk.test.modularity/bin/common-override/java.xml .
[2024-08-28T23:53:29.090Z] STF 23:53:28.197 - Redirecting stderr to /home/jenkins/workspace/Test_openjdk11_hs_sanity.system_aarch64_linux_testList_2/aqa-tests/TKG/output_1724887027922/PatMod_Adv_0/20240828-235310-PatModTest/results/3.CMJ.stderr
[2024-08-28T23:53:29.090Z] STF 23:53:28.197 - Redirecting stdout to /home/jenkins/workspace/Test_openjdk11_hs_sanity.system_aarch64_linux_testList_2/aqa-tests/TKG/output_1724887027922/PatMod_Adv_0/20240828-235310-PatModTest/results/3.CMJ.stdout
[2024-08-28T23:53:29.090Z] STF 23:53:28.214 - Monitoring processes: CMJ
[2024-08-28T23:53:29.957Z] STF 23:53:29.857 - Monitoring Report Summary:
[2024-08-28T23:53:29.958Z] STF 23:53:29.857 - o Process CMJ ended with the expected exit code (0)
[2024-08-28T23:53:29.958Z] STF 23:53:29.859 - Created modular jar: 3.java.xml.jar
[2024-08-28T23:53:29.958Z] STF 23:53:29.859 -
[2024-08-28T23:53:29.958Z] STF 23:53:29.860 - +------ Step 4 - Run application class override test where we specify two exploded module paths in a single --patch-module option
[2024-08-28T23:53:29.958Z] STF 23:53:29.861 - | Run foreground process
[2024-08-28T23:53:29.958Z] STF 23:53:29.861 - | Program: /home/jenkins/workspace/Test_openjdk11_hs_sanity.system_aarch64_linux_testList_2/jdkbinary/j2sdk-image/bin/java
[2024-08-28T23:53:29.958Z] STF 23:53:29.861 - | Mnemonic: OT56
[2024-08-28T23:53:29.958Z] STF 23:53:29.861 - | Echo: ECHO_ON
[2024-08-28T23:53:29.958Z] STF 23:53:29.861 - | Expectation: CLEAN_RUN within 1m
[2024-08-28T23:53:29.958Z] STF 23:53:29.861 - |
[2024-08-28T23:53:29.958Z] STF 23:53:29.861 - Running command: /home/jenkins/workspace/Test_openjdk11_hs_sanity.system_aarch64_linux_testList_2/jdkbinary/j2sdk-image/bin/java --add-reads com.test=ALL-UNNAMED --module-path /home/jenkins/workspace/Test_openjdk11_hs_sanity.system_aarch64_linux_testList_2/jvmtest/system/aqa-systemtest/openjdk.test.modularity/bin/common-mods:/home/jenkins/workspace/Test_openjdk11_hs_sanity.system_aarch64_linux_testList_2/jvmtest/system/aqa-systemtest/openjdk.test.modularity/bin/tests --add-modules=com.test --add-exports com.hello/adoptopenjdk.test.modularity.newpkg=com.test --patch-module com.hello=/home/jenkins/workspace/Test_openjdk11_hs_sanity.system_aarch64_linux_testList_2/jvmtest/system/aqa-systemtest/openjdk.test.modularity/bin/common-override/com.hello:/home/jenkins/workspace/Test_openjdk11_hs_sanity.system_aarch64_linux_testList_2/jvmtest/system/aqa-systemtest/openjdk.test.modularity/bin/common-override-new/com.hello -XX:+UseCompressedOops -classpath /home/jenkins/testDependency/system_lib/junit/junit.jar:/home/jenkins/testDependency/system_lib/junit/hamcrest-core.jar org.junit.runner.JUnitCore net.adoptopenjdk.test.modularity.junit.TestOverrideUsingMultipleFilePaths
[2024-08-28T23:53:29.958Z] STF 23:53:29.861 - Redirecting stderr to /home/jenkins/workspace/Test_openjdk11_hs_sanity.system_aarch64_linux_testList_2/aqa-tests/TKG/output_1724887027922/PatMod_Adv_0/20240828-235310-PatModTest/results/4.OT56.stderr
[2024-08-28T23:53:29.958Z] STF 23:53:29.861 - Redirecting stdout to /home/jenkins/workspace/Test_openjdk11_hs_sanity.system_aarch64_linux_testList_2/aqa-tests/TKG/output_1724887027922/PatMod_Adv_0/20240828-235310-PatModTest/results/4.OT56.stdout
[2024-08-28T23:53:30.771Z] STF 23:53:29.883 - Monitoring processes: OT56
[2024-08-28T23:53:31.629Z] OT56 stderr WARNING: module-info.class ignored in patch: /home/jenkins/workspace/Test_openjdk11_hs_sanity.system_aarch64_linux_testList_2/jvmtest/system/aqa-systemtest/openjdk.test.modularity/bin/common-override/com.hello
[2024-08-28T23:53:31.629Z] OT56 stderr WARNING: module-info.class ignored in patch: /home/jenkins/workspace/Test_openjdk11_hs_sanity.system_aarch64_linux_testList_2/jvmtest/system/aqa-systemtest/openjdk.test.modularity/bin/common-override-new/com.hello
[2024-08-28T23:53:32.430Z] OT56 JUnit version 4.12
[2024-08-28T23:53:33.228Z] OT56 ...
[2024-08-28T23:53:33.228Z] OT56 Time: 0.089
[2024-08-28T23:53:33.228Z] OT56
[2024-08-28T23:53:33.228Z] OT56 OK (3 tests)
[2024-08-28T23:53:33.228Z] OT56
[2024-08-28T23:53:33.228Z] STF 23:53:32.849 - Monitoring Report Summary:
[2024-08-28T23:53:33.228Z] STF 23:53:32.850 - o Process OT56 ended with the expected exit code (0)
[2024-08-28T23:53:33.228Z] STF 23:53:32.850 -
[2024-08-28T23:53:33.228Z] STF 23:53:32.850 - +------ Step 5 - (Negative test) Verify if a module can be specified only once on --patch-module
[2024-08-28T23:53:33.228Z] STF 23:53:32.850 - | Run foreground process
[2024-08-28T23:53:33.228Z] STF 23:53:32.850 - | Program: /home/jenkins/workspace/Test_openjdk11_hs_sanity.system_aarch64_linux_testList_2/jdkbinary/j2sdk-image/bin/java
[2024-08-28T23:53:33.228Z] STF 23:53:32.850 - | Mnemonic: OT7
[2024-08-28T23:53:33.228Z] STF 23:53:32.850 - | Echo: ECHO_ON
[2024-08-28T23:53:33.228Z] STF 23:53:32.850 - | Expectation: NON_ZERO_EXIT [1] within 1m
[2024-08-28T23:53:33.228Z] STF 23:53:32.850 - |
[2024-08-28T23:53:33.229Z] STF 23:53:32.856 - Running command: /home/jenkins/workspace/Test_openjdk11_hs_sanity.system_aarch64_linux_testList_2/jdkbinary/j2sdk-image/bin/java --add-reads com.test=ALL-UNNAMED --module-path /home/jenkins/workspace/Test_openjdk11_hs_sanity.system_aarch64_linux_testList_2/jvmtest/system/aqa-systemtest/openjdk.test.modularity/bin/common-mods:/home/jenkins/workspace/Test_openjdk11_hs_sanity.system_aarch64_linux_testList_2/jvmtest/system/aqa-systemtest/openjdk.test.modularity/bin/tests --add-modules=com.test --patch-module com.hello=/home/jenkins/workspace/Test_openjdk11_hs_sanity.system_aarch64_linux_testList_2/jvmtest/system/aqa-systemtest/openjdk.test.modularity/bin/common-override-new/com.hello --patch-module com.hello=/home/jenkins/workspace/Test_openjdk11_hs_sanity.system_aarch64_linux_testList_2/jvmtest/system/aqa-systemtest/openjdk.test.modularity/bin/common-override/com.hello -XX:+UseCompressedOops -classpath /home/jenkins/testDependency/system_lib/junit/junit.jar:/home/jenkins/testDependency/system_lib/junit/hamcrest-core.jar org.junit.runner.JUnitCore net.adoptopenjdk.test.modularity.junit.TestOverrideUsingAppModule
[2024-08-28T23:53:33.229Z] STF 23:53:32.856 - Redirecting stderr to /home/jenkins/workspace/Test_openjdk11_hs_sanity.system_aarch64_linux_testList_2/aqa-tests/TKG/output_1724887027922/PatMod_Adv_0/20240828-235310-PatModTest/results/5.OT7.stderr
[2024-08-28T23:53:33.229Z] STF 23:53:32.856 - Redirecting stdout to /home/jenkins/workspace/Test_openjdk11_hs_sanity.system_aarch64_linux_testList_2/aqa-tests/TKG/output_1724887027922/PatMod_Adv_0/20240828-235310-PatModTest/results/5.OT7.stdout
[2024-08-28T23:53:33.229Z] STF 23:53:32.865 - Monitoring processes: OT7
[2024-08-28T23:53:34.012Z] OT7 Error occurred during initialization of boot layer
[2024-08-28T23:53:34.012Z] OT7 java.lang.ExceptionInInitializerError
[2024-08-28T23:53:34.012Z] OT7 Caused by: java.lang.RuntimeException: com.hello specified more than once to --patch-module
[2024-08-28T23:53:34.012Z] STF 23:53:33.484 - Monitoring Report Summary:
[2024-08-28T23:53:34.012Z] STF 23:53:33.484 - o Process OT7 ended with the expected exit code (1)
[2024-08-28T23:53:34.012Z] STF 23:53:33.484 -
[2024-08-28T23:53:34.012Z] STF 23:53:33.484 - +------ Step 6 - Combine stderr and stdout files of process OT7
[2024-08-28T23:53:34.012Z] STF 23:53:33.484 - | Run foreground process
[2024-08-28T23:53:34.012Z] STF 23:53:33.484 - | Program: /home/jenkins/workspace/Test_openjdk11_hs_sanity.system_aarch64_linux_testList_2/jdkbinary/j2sdk-image/bin/java
[2024-08-28T23:53:34.012Z] STF 23:53:33.484 - | Mnemonic: CO
[2024-08-28T23:53:34.012Z] STF 23:53:33.484 - | Echo: ECHO_OFF
[2024-08-28T23:53:34.012Z] STF 23:53:33.484 - | Expectation: NON_ZERO_EXIT [0] within 30s
[2024-08-28T23:53:34.012Z] STF 23:53:33.484 - |
[2024-08-28T23:53:34.012Z] STF 23:53:33.485 - Running command: /home/jenkins/workspace/Test_openjdk11_hs_sanity.system_aarch64_linux_testList_2/jdkbinary/j2sdk-image/bin/java -Dfile1=/home/jenkins/workspace/Test_openjdk11_hs_sanity.system_aarch64_linux_testList_2/aqa-tests/TKG/output_1724887027922/PatMod_Adv_0/20240828-235310-PatModTest/results/5.OT7.stdout -Dfile2=/home/jenkins/workspace/Test_openjdk11_hs_sanity.system_aarch64_linux_testList_2/aqa-tests/TKG/output_1724887027922/PatMod_Adv_0/20240828-235310-PatModTest/results/5.OT7.stderr -Dfinal.file=/home/jenkins/workspace/Test_openjdk11_hs_sanity.system_aarch64_linux_testList_2/aqa-tests/TKG/output_1724887027922/PatMod_Adv_0/20240828-235310-PatModTest/results/combinedOT7.txt -XX:+UseCompressedOops -classpath /home/jenkins/workspace/Test_openjdk11_hs_sanity.system_aarch64_linux_testList_2/jvmtest/system/STF/stf.core/bin:/home/jenkins/workspace/Test_openjdk11_hs_sanity.system_aarch64_linux_testList_2/jvmtest/system/aqa-systemtest/openjdk.test.modularity/bin net.adoptopenjdk.test.modularity.TestUtil
[2024-08-28T23:53:34.012Z] STF 23:53:33.485 - Redirecting stderr to /home/jenkins/workspace/Test_openjdk11_hs_sanity.system_aarch64_linux_testList_2/aqa-tests/TKG/output_1724887027922/PatMod_Adv_0/20240828-235310-PatModTest/results/6.CO.stderr
[2024-08-28T23:53:34.012Z] STF 23:53:33.485 - Redirecting stdout to /home/jenkins/workspace/Test_openjdk11_hs_sanity.system_aarch64_linux_testList_2/aqa-tests/TKG/output_1724887027922/PatMod_Adv_0/20240828-235310-PatModTest/results/6.CO.stdout
[2024-08-28T23:53:34.012Z] STF 23:53:33.505 - Monitoring processes: CO
[2024-08-28T23:53:35.700Z] STF 23:53:34.832 - Monitoring Report Summary:
[2024-08-28T23:53:35.701Z] STF 23:53:34.832 - o Process CO ended with the expected exit code (0)
[2024-08-28T23:53:35.701Z] STF 23:53:34.832 -
[2024-08-28T23:53:35.701Z] STF 23:53:34.832 - +------ Step 7 - Check output
[2024-08-28T23:53:35.701Z] STF 23:53:34.832 - | Count file matches
[2024-08-28T23:53:35.701Z] STF 23:53:34.836 - | TargetFile: /home/jenkins/workspace/Test_openjdk11_hs_sanity.system_aarch64_linux_testList_2/aqa-tests/TKG/output_1724887027922/PatMod_Adv_0/20240828-235310-PatModTest/results/combinedOT7.txt
[2024-08-28T23:53:35.701Z] STF 23:53:34.836 - | ExpectedNumMatches: 1
[2024-08-28T23:53:35.701Z] STF 23:53:34.836 - | SearchStrings: ["java.lang.ExceptionInInitializerError"]
[2024-08-28T23:53:35.701Z] STF 23:53:34.836 - |
[2024-08-28T23:53:35.701Z] STF 23:53:34.837 - Found 1 instances of ["java.lang.ExceptionInInitializerError"]
[2024-08-28T23:53:35.701Z] STF 23:53:34.837 -
[2024-08-28T23:53:35.701Z] STF 23:53:34.837 - +------ Step 8 - (Negative test) Verify if --patch-module allows replacing of module-info.class
[2024-08-28T23:53:35.701Z] STF 23:53:34.837 - | Run foreground process
[2024-08-28T23:53:35.701Z] STF 23:53:34.837 - | Program: /home/jenkins/workspace/Test_openjdk11_hs_sanity.system_aarch64_linux_testList_2/jdkbinary/j2sdk-image/bin/java
[2024-08-28T23:53:35.701Z] STF 23:53:34.837 - | Mnemonic: OT8
[2024-08-28T23:53:35.701Z] STF 23:53:34.837 - | Echo: ECHO_ON
[2024-08-28T23:53:35.701Z] STF 23:53:34.837 - | Expectation: NON_ZERO_EXIT [1] within 1m
[2024-08-28T23:53:35.701Z] STF 23:53:34.837 - |
[2024-08-28T23:53:35.701Z] STF 23:53:34.837 - Running command: /home/jenkins/workspace/Test_openjdk11_hs_sanity.system_aarch64_linux_testList_2/jdkbinary/j2sdk-image/bin/java --add-reads com.test=ALL-UNNAMED --module-path /home/jenkins/workspace/Test_openjdk11_hs_sanity.system_aarch64_linux_testList_2/jvmtest/system/aqa-systemtest/openjdk.test.modularity/bin/common-mods:/home/jenkins/workspace/Test_openjdk11_hs_sanity.system_aarch64_linux_testList_2/jvmtest/system/aqa-systemtest/openjdk.test.modularity/bin/tests --add-modules=com.test --patch-module com.hello=/home/jenkins/workspace/Test_openjdk11_hs_sanity.system_aarch64_linux_testList_2/jvmtest/system/aqa-systemtest/openjdk.test.modularity/bin/common-override-new/com.hello -XX:+UseCompressedOops -classpath /home/jenkins/testDependency/system_lib/junit/junit.jar:/home/jenkins/testDependency/system_lib/junit/hamcrest-core.jar org.junit.runner.JUnitCore net.adoptopenjdk.test.modularity.junit.TestOverrideUsingUnexportedPublicType
[2024-08-28T23:53:35.701Z] STF 23:53:34.837 - Redirecting stderr to /home/jenkins/workspace/Test_openjdk11_hs_sanity.system_aarch64_linux_testList_2/aqa-tests/TKG/output_1724887027922/PatMod_Adv_0/20240828-235310-PatModTest/results/8.OT8.stderr
[2024-08-28T23:53:35.701Z] STF 23:53:34.837 - Redirecting stdout to /home/jenkins/workspace/Test_openjdk11_hs_sanity.system_aarch64_linux_testList_2/aqa-tests/TKG/output_1724887027922/PatMod_Adv_0/20240828-235310-PatModTest/results/8.OT8.stdout
[2024-08-28T23:53:35.701Z] STF 23:53:34.849 - Monitoring processes: OT8
[2024-08-28T23:53:37.340Z] OT8 stderr WARNING: module-info.class ignored in patch: /home/jenkins/workspace/Test_openjdk11_hs_sanity.system_aarch64_linux_testList_2/jvmtest/system/aqa-systemtest/openjdk.test.modularity/bin/common-override-new/com.hello
[2024-08-28T23:53:38.140Z] OT8 JUnit version 4.12
[2024-08-28T23:53:38.939Z] OT8 .E
[2024-08-28T23:53:39.722Z] OT8 Time: 0.072
[2024-08-28T23:53:39.722Z] OT8 There was 1 failure:
[2024-08-28T23:53:39.722Z] OT8 1) testPatchingOfNewClassInExistingPackage(net.adoptopenjdk.test.modularity.junit.TestOverrideUsingUnexportedPublicType)
[2024-08-28T23:53:39.722Z] OT8 java.lang.IllegalAccessException: class net.adoptopenjdk.test.modularity.junit.TestOverrideUsingUnexportedPublicType (in module com.test) cannot access class adoptopenjdk.test.modularity.newpkg.NewClass2 (in module com.hello) because module com.hello does not export adoptopenjdk.test.modularity.newpkg to module com.test
[2024-08-28T23:53:39.722Z] OT8 at java.base/jdk.internal.reflect.Reflection.newIllegalAccessException(Reflection.java:361)
[2024-08-28T23:53:39.722Z] OT8 at java.base/java.lang.reflect.AccessibleObject.checkAccess(AccessibleObject.java:591)
[2024-08-28T23:53:39.722Z] OT8 at java.base/java.lang.reflect.Constructor.newInstance(Constructor.java:481)
[2024-08-28T23:53:39.722Z] OT8 at com.test/net.adoptopenjdk.test.modularity.junit.TestOverrideUsingUnexportedPublicType.testPatchingOfNewClassInExistingPackage(TestOverrideUsingUnexportedPublicType.java:34)
[2024-08-28T23:53:39.722Z] OT8 at java.base/jdk.internal.reflect.NativeMethodAccessorImpl.invoke0(Native Method)
[2024-08-28T23:53:39.722Z] OT8 at java.base/jdk.internal.reflect.NativeMethodAccessorImpl.invoke(NativeMethodAccessorImpl.java:62)
[2024-08-28T23:53:39.722Z] OT8 at java.base/jdk.internal.reflect.DelegatingMethodAccessorImpl.invoke(DelegatingMethodAccessorImpl.java:43)
[2024-08-28T23:53:39.722Z] OT8 at java.base/java.lang.reflect.Method.invoke(Method.java:566)
[2024-08-28T23:53:39.722Z] OT8 at org.junit.runners.model.FrameworkMethod$1.runReflectiveCall(FrameworkMethod.java:50)
[2024-08-28T23:53:39.722Z] OT8 at org.junit.internal.runners.model.ReflectiveCallable.run(ReflectiveCallable.java:12)
[2024-08-28T23:53:39.722Z] OT8 at org.junit.runners.model.FrameworkMethod.invokeExplosively(FrameworkMethod.java:47)
[2024-08-28T23:53:39.722Z] OT8 at org.junit.internal.runners.statements.InvokeMethod.evaluate(InvokeMethod.java:17)
[2024-08-28T23:53:39.722Z] OT8 at org.junit.runners.ParentRunner.runLeaf(ParentRunner.java:325)
[2024-08-28T23:53:39.722Z] OT8 at org.junit.runners.BlockJUnit4ClassRunner.runChild(BlockJUnit4ClassRunner.java:78)
[2024-08-28T23:53:39.722Z] OT8 at org.junit.runners.BlockJUnit4ClassRunner.runChild(BlockJUnit4ClassRunner.java:57)
[2024-08-28T23:53:39.722Z] OT8 at org.junit.runners.ParentRunner$3.run(ParentRunner.java:290)
[2024-08-28T23:53:39.722Z] OT8 at org.junit.runners.ParentRunner$1.schedule(ParentRunner.java:71)
[2024-08-28T23:53:39.722Z] OT8 at org.junit.runners.ParentRunner.runChildren(ParentRunner.java:288)
[2024-08-28T23:53:39.722Z] OT8 at org.junit.runners.ParentRunner.access$000(ParentRunner.java:58)
[2024-08-28T23:53:39.722Z] OT8 at org.junit.runners.ParentRunner$2.evaluate(ParentRunner.java:268)
[2024-08-28T23:53:39.722Z] OT8 at org.junit.runners.ParentRunner.run(ParentRunner.java:363)
[2024-08-28T23:53:39.722Z] OT8 at org.junit.runners.Suite.runChild(Suite.java:128)
[2024-08-28T23:53:39.722Z] OT8 at org.junit.runners.Suite.runChild(Suite.java:27)
[2024-08-28T23:53:39.722Z] OT8 at org.junit.runners.ParentRunner$3.run(ParentRunner.java:290)
[2024-08-28T23:53:39.722Z] OT8 at org.junit.runners.ParentRunner$1.schedule(ParentRunner.java:71)
[2024-08-28T23:53:39.722Z] OT8 at org.junit.runners.ParentRunner.runChildren(ParentRunner.java:288)
[2024-08-28T23:53:39.723Z] OT8 at org.junit.runners.ParentRunner.access$000(ParentRunner.java:58)
[2024-08-28T23:53:39.723Z] OT8 at org.junit.runners.ParentRunner$2.evaluate(ParentRunner.java:268)
[2024-08-28T23:53:39.723Z] OT8 at org.junit.runners.ParentRunner.run(ParentRunner.java:363)
[2024-08-28T23:53:39.723Z] OT8 at org.junit.runner.JUnitCore.run(JUnitCore.java:137)
[2024-08-28T23:53:39.723Z] OT8 at org.junit.runner.JUnitCore.run(JUnitCore.java:115)
[2024-08-28T23:53:39.723Z] OT8 at org.junit.runner.JUnitCore.runMain(JUnitCore.java:77)
[2024-08-28T23:53:39.723Z] OT8 at org.junit.runner.JUnitCore.main(JUnitCore.java:36)
[2024-08-28T23:53:39.723Z] OT8
[2024-08-28T23:53:39.723Z] OT8 FAILURES!!!
[2024-08-28T23:53:39.723Z] OT8 Tests run: 1, Failures: 1
[2024-08-28T23:53:39.723Z] OT8
[2024-08-28T23:53:39.723Z] STF 23:53:38.941 - Monitoring Report Summary:
[2024-08-28T23:53:39.723Z] STF 23:53:38.941 - o Process OT8 ended with the expected exit code (1)
[2024-08-28T23:53:39.723Z] STF 23:53:38.941 -
[2024-08-28T23:53:39.723Z] STF 23:53:38.941 - +------ Step 9 - Check output
[2024-08-28T23:53:39.723Z] STF 23:53:38.941 - | Count file matches
[2024-08-28T23:53:39.723Z] STF 23:53:38.941 - | TargetFile: /home/jenkins/workspace/Test_openjdk11_hs_sanity.system_aarch64_linux_testList_2/aqa-tests/TKG/output_1724887027922/PatMod_Adv_0/20240828-235310-PatModTest/results/8.OT8.stdout
[2024-08-28T23:53:39.723Z] STF 23:53:38.941 - | ExpectedNumMatches: 1
[2024-08-28T23:53:39.723Z] STF 23:53:38.941 - | SearchStrings: ["java.lang.IllegalAccessException"]
[2024-08-28T23:53:39.723Z] STF 23:53:38.941 - |
[2024-08-28T23:53:39.723Z] STF 23:53:38.941 - Found 1 instances of ["java.lang.IllegalAccessException"]
[2024-08-28T23:53:39.723Z] STF 23:53:38.941 - EXECUTE stage completed
[2024-08-28T23:53:39.723Z] STF 23:53:39.091 -
[2024-08-28T23:53:39.723Z] STF 23:53:39.091 - ==================== T E A R D O W N ====================
[2024-08-28T23:53:39.723Z] STF 23:53:39.091 - Running teardown: perl /home/jenkins/workspace/Test_openjdk11_hs_sanity.system_aarch64_linux_testList_2/aqa-tests/TKG/../TKG/output_1724887027922/PatMod_Adv_0/20240828-235310-PatModTest/tearDown.pl
[2024-08-28T23:53:39.723Z] STF 23:53:39.493 - TEARDOWN stage completed
[2024-08-28T23:53:39.723Z] STF 23:53:39.507 -
[2024-08-28T23:53:39.723Z] STF 23:53:39.507 - ===================== R E S U L T S =====================
[2024-08-28T23:53:39.723Z] STF 23:53:39.507 - Stage results:
[2024-08-28T23:53:39.723Z] STF 23:53:39.507 - setUp: pass
[2024-08-28T23:53:39.723Z] STF 23:53:39.507 - execute: pass
[2024-08-28T23:53:39.723Z] STF 23:53:39.507 - teardown: pass
[2024-08-28T23:53:39.723Z] STF 23:53:39.507 -
[2024-08-28T23:53:39.723Z] STF 23:53:39.507 - Overall result: PASSED
[2024-08-28T23:53:39.723Z] -----------------------------------
[2024-08-28T23:53:39.723Z] PatMod_Adv_0_PASSED
[2024-08-28T23:53:39.723Z] -----------------------------------
[2024-08-28T23:53:39.723Z]
[2024-08-28T23:53:39.723Z] TEST TEARDOWN:
[2024-08-28T23:53:39.723Z] Nothing to be done for teardown.
[2024-08-28T23:53:40.514Z] PatMod_Adv_0 Finish Time: Wed Aug 28 23:53:39 2024 Epoch Time (ms): 1724889219641