PatModImg_Adv_0
[2024-11-08T16:51:15.873Z] Running test PatModImg_Adv_0 ...
[2024-11-08T16:51:15.873Z] ===============================================
[2024-11-08T16:51:16.654Z] PatModImg_Adv_0 Start Time: Fri Nov 8 16:51:15 2024 Epoch Time (ms): 1731084675813
[2024-11-08T16:51:16.654Z] variation: Mode150
[2024-11-08T16:51:16.654Z] JVM_OPTIONS: -XX:+UseCompressedOops
[2024-11-08T16:51:16.654Z] { \
[2024-11-08T16:51:16.654Z] echo ""; echo "TEST SETUP:"; \
[2024-11-08T16:51:16.654Z] echo "Nothing to be done for setup."; \
[2024-11-08T16:51:16.654Z] mkdir -p "/home/jenkins/workspace/Test_openjdk17_hs_sanity.system_aarch64_linux_testList_2/aqa-tests/TKG/../TKG/output_17310791723895/PatModImg_Adv_0"; \
[2024-11-08T16:51:16.654Z] cd "/home/jenkins/workspace/Test_openjdk17_hs_sanity.system_aarch64_linux_testList_2/aqa-tests/TKG/../TKG/output_17310791723895/PatModImg_Adv_0"; \
[2024-11-08T16:51:16.654Z] echo ""; echo "TESTING:"; \
[2024-11-08T16:51:16.654Z] perl /home/jenkins/workspace/Test_openjdk17_hs_sanity.system_aarch64_linux_testList_2/aqa-tests/TKG/../../jvmtest/system/modularity/..//STF/stf.core/scripts/stf.pl -test-root="/home/jenkins/workspace/Test_openjdk17_hs_sanity.system_aarch64_linux_testList_2/aqa-tests/TKG/../../jvmtest/system/modularity/..//STF;/home/jenkins/workspace/Test_openjdk17_hs_sanity.system_aarch64_linux_testList_2/aqa-tests/TKG/../../jvmtest/system/modularity/..//aqa-systemtest""" -systemtest-prereqs="/home/jenkins/workspace/Test_openjdk17_hs_sanity.system_aarch64_linux_testList_2/../../testDependency/system_lib/" -java-args=' -XX:+UseCompressedOops ' -results-root="/home/jenkins/workspace/Test_openjdk17_hs_sanity.system_aarch64_linux_testList_2/aqa-tests/TKG/../TKG/output_17310791723895/PatModImg_Adv_0" -test=PatModImgTest -test-args="variant=Adv"; \
[2024-11-08T16:51:16.654Z] if [ $? -eq 0 ]; then echo "-----------------------------------"; echo "PatModImg_Adv_0""_PASSED"; echo "-----------------------------------"; cd /home/jenkins/workspace/Test_openjdk17_hs_sanity.system_aarch64_linux_testList_2/aqa-tests/TKG/..; rm -f -r "/home/jenkins/workspace/Test_openjdk17_hs_sanity.system_aarch64_linux_testList_2/aqa-tests/TKG/../TKG/output_17310791723895/PatModImg_Adv_0"; else echo "-----------------------------------"; echo "PatModImg_Adv_0""_FAILED"; echo "-----------------------------------"; fi; \
[2024-11-08T16:51:16.654Z] echo ""; echo "TEST TEARDOWN:"; \
[2024-11-08T16:51:16.654Z] echo "Nothing to be done for teardown."; \
[2024-11-08T16:51:16.654Z] } 2>&1 | tee -a "/home/jenkins/workspace/Test_openjdk17_hs_sanity.system_aarch64_linux_testList_2/aqa-tests/TKG/../TKG/output_17310791723895/TestTargetResult";
[2024-11-08T16:51:16.654Z]
[2024-11-08T16:51:16.654Z] TEST SETUP:
[2024-11-08T16:51:16.654Z] Nothing to be done for setup.
[2024-11-08T16:51:16.654Z]
[2024-11-08T16:51:16.654Z] TESTING:
[2024-11-08T16:51:16.654Z] STF 16:51:16.517 - ========================= S T F =========================
[2024-11-08T16:51:16.654Z] systemtest-prereqs has been processed, and set to: /home/jenkins/testDependency/system_libRetrieving amount of free space on drive containing /home/jenkins/workspace/Test_openjdk17_hs_sanity.system_aarch64_linux_testList_2/aqa-tests/TKG/../TKG/output_17310791723895/PatModImg_Adv_0
[2024-11-08T16:51:17.427Z] There is 721122 Mb free
[2024-11-08T16:51:17.427Z] STF 16:51:16.575 - ================== G E N E R A T I O N ==================
[2024-11-08T16:51:17.427Z] STF 16:51:16.576 - Checking JVM: /home/jenkins/workspace/Test_openjdk17_hs_sanity.system_aarch64_linux_testList_2/jdkbinary/j2sdk-image
[2024-11-08T16:51:17.427Z] STF 16:51:16.576 - Starting process to generate scripts: /home/jenkins/workspace/Test_openjdk17_hs_sanity.system_aarch64_linux_testList_2/jdkbinary/j2sdk-image/bin/java -Dlog4j.skipJansi=true -Djava.system.class.loader=net.adoptopenjdk.stf.runner.StfClassLoader -classpath /home/jenkins/workspace/Test_openjdk17_hs_sanity.system_aarch64_linux_testList_2/../../testDependency/system_lib//log4j/log4j-api.jar:/home/jenkins/workspace/Test_openjdk17_hs_sanity.system_aarch64_linux_testList_2/../../testDependency/system_lib//log4j/log4j-core.jar:/home/jenkins/workspace/Test_openjdk17_hs_sanity.system_aarch64_linux_testList_2/jvmtest/system/STF/stf.core/scripts/../bin net.adoptopenjdk.stf.runner.StfRunner -properties "/home/jenkins/workspace/Test_openjdk17_hs_sanity.system_aarch64_linux_testList_2/aqa-tests/TKG/../TKG/output_17310791723895/PatModImg_Adv_0/20241108-165116-PatModImgTest/stf_parameters.properties, , /home/jenkins/workspace/Test_openjdk17_hs_sanity.system_aarch64_linux_testList_2/jvmtest/system/STF/stf.core/config/stf.properties" -testDir "/home/jenkins/workspace/Test_openjdk17_hs_sanity.system_aarch64_linux_testList_2/aqa-tests/TKG/../TKG/output_17310791723895/PatModImg_Adv_0/20241108-165116-PatModImgTest"
[2024-11-08T16:51:17.427Z] GEN stderr OpenJDK 64-Bit Server VM warning: Archived non-system classes are disabled because the java.system.class.loader property is specified (value = "net.adoptopenjdk.stf.runner.StfClassLoader"). To use archived non-system classes, this property must not be set
[2024-11-08T16:51:23.312Z] GEN 16:51:22.122 - Found test. Project: 'openjdk.test.modularity' class: 'PatModImgTest.class' Dir: '/home/jenkins/workspace/Test_openjdk17_hs_sanity.system_aarch64_linux_testList_2/jvmtest/system/aqa-systemtest/openjdk.test.modularity/bin'
[2024-11-08T16:51:23.312Z] GEN 16:51:22.187 - Found test. Project: 'openjdk.test.modularity' class: 'net.adoptopenjdk.test.modularity.PatModImgTest'
[2024-11-08T16:51:24.826Z] GEN Classpath directories used by project 'openjdk.test.modularity':
[2024-11-08T16:51:24.827Z] GEN /home/jenkins/workspace/Test_openjdk17_hs_sanity.system_aarch64_linux_testList_2/jvmtest/system/aqa-systemtest/openjdk.test.modularity/bin/common-mods/displayService
[2024-11-08T16:51:24.827Z] GEN /home/jenkins/workspace/Test_openjdk17_hs_sanity.system_aarch64_linux_testList_2/jvmtest/system/aqa-systemtest/openjdk.test.modularity/bin/common-mods/com.helper
[2024-11-08T16:51:24.827Z] GEN /home/jenkins/workspace/Test_openjdk17_hs_sanity.system_aarch64_linux_testList_2/jvmtest/system/aqa-systemtest/openjdk.test.modularity/bin/common-mods/displayServiceImpl1
[2024-11-08T16:51:24.827Z] GEN /home/jenkins/workspace/Test_openjdk17_hs_sanity.system_aarch64_linux_testList_2/jvmtest/system/aqa-systemtest/openjdk.test.modularity/bin/common-mods/com.discreet
[2024-11-08T16:51:24.827Z] GEN /home/jenkins/workspace/Test_openjdk17_hs_sanity.system_aarch64_linux_testList_2/jvmtest/system/aqa-systemtest/openjdk.test.modularity/bin/common-mods/com.hello
[2024-11-08T16:51:24.827Z] GEN /home/jenkins/workspace/Test_openjdk17_hs_sanity.system_aarch64_linux_testList_2/jvmtest/system/aqa-systemtest/openjdk.test.modularity/bin/common-mods/com.hola
[2024-11-08T16:51:24.827Z] GEN /home/jenkins/workspace/Test_openjdk17_hs_sanity.system_aarch64_linux_testList_2/jvmtest/system/aqa-systemtest/openjdk.test.modularity/bin/common-mods/displayServiceImpl2
[2024-11-08T16:51:24.827Z] GEN /home/jenkins/workspace/Test_openjdk17_hs_sanity.system_aarch64_linux_testList_2/jvmtest/system/aqa-systemtest/openjdk.test.modularity/bin/common-mods/com.hi
[2024-11-08T16:51:24.827Z] GEN /home/jenkins/workspace/Test_openjdk17_hs_sanity.system_aarch64_linux_testList_2/jvmtest/system/aqa-systemtest/openjdk.test.modularity/bin/common-override
[2024-11-08T16:51:24.827Z] GEN /home/jenkins/workspace/Test_openjdk17_hs_sanity.system_aarch64_linux_testList_2/jvmtest/system/aqa-systemtest/openjdk.test.modularity/bin/common-override-new
[2024-11-08T16:51:24.827Z] GEN /home/jenkins/workspace/Test_openjdk17_hs_sanity.system_aarch64_linux_testList_2/jvmtest/system/aqa-systemtest/openjdk.test.modularity/bin/common/displayServiceImpl3
[2024-11-08T16:51:24.827Z] GEN /home/jenkins/workspace/Test_openjdk17_hs_sanity.system_aarch64_linux_testList_2/jvmtest/system/aqa-systemtest/openjdk.test.modularity/bin/common/displayServiceImpl4
[2024-11-08T16:51:24.827Z] GEN /home/jenkins/workspace/Test_openjdk17_hs_sanity.system_aarch64_linux_testList_2/jvmtest/system/aqa-systemtest/openjdk.test.modularity/bin/common
[2024-11-08T16:51:24.827Z] GEN /home/jenkins/workspace/Test_openjdk17_hs_sanity.system_aarch64_linux_testList_2/jvmtest/system/aqa-systemtest/openjdk.test.modularity/bin/tests
[2024-11-08T16:51:24.827Z] GEN /home/jenkins/workspace/Test_openjdk17_hs_sanity.system_aarch64_linux_testList_2/jvmtest/system/aqa-systemtest/openjdk.test.modularity/bin
[2024-11-08T16:51:24.827Z] GEN /home/jenkins/workspace/Test_openjdk17_hs_sanity.system_aarch64_linux_testList_2/jvmtest/system/STF/stf.core/bin
[2024-11-08T16:51:24.827Z] GEN /home/jenkins/testDependency/system_lib/log4j/log4j-api.jar
[2024-11-08T16:51:24.827Z] GEN /home/jenkins/testDependency/system_lib/log4j/log4j-core.jar
[2024-11-08T16:51:24.827Z] GEN /home/jenkins/testDependency/system_lib/junit/junit.jar
[2024-11-08T16:51:24.827Z] GEN 16:51:23.514 - Using Mode NoOptions. Values = ''
[2024-11-08T16:51:24.827Z] GEN 16:51:24.272 -
[2024-11-08T16:51:24.827Z] GEN 16:51:24.272 - Test command summary:
[2024-11-08T16:51:24.827Z] GEN 16:51:24.272 - Step Stage Command Description
[2024-11-08T16:51:24.827Z] GEN 16:51:24.272 - -----+--------+-----------------+------------
[2024-11-08T16:51:24.827Z] GEN 16:51:24.273 - 1 execute jar Create com.hello jar
[2024-11-08T16:51:24.827Z] GEN 16:51:24.273 - 2 execute jar Create com.hola jar
[2024-11-08T16:51:24.827Z] GEN 16:51:24.273 - 3 execute jar Create com.helper jar
[2024-11-08T16:51:24.827Z] GEN 16:51:24.273 - 4 execute jar Create com.discreet jar
[2024-11-08T16:51:24.827Z] GEN 16:51:24.273 - 5 execute jar Create tests jar
[2024-11-08T16:51:24.827Z] GEN 16:51:24.273 - 6 execute jlink Create runtime image for PatchModule test
[2024-11-08T16:51:24.827Z] GEN 16:51:24.273 - 7 execute jar Create com.hello jar
[2024-11-08T16:51:24.827Z] GEN 16:51:24.273 - 8 execute jar create java.xml.jar
[2024-11-08T16:51:24.827Z] GEN 16:51:24.273 - 9 execute Run java Run application class override test where we specify two exploded module paths in a single --patch-module option
[2024-11-08T16:51:24.827Z] GEN 16:51:24.273 - 10 execute Run java Verify if a module can be specified only once on --patch-module
[2024-11-08T16:51:24.827Z] GEN 16:51:24.273 - 11 execute Run java Combine stderr and stdout files of process OT7
[2024-11-08T16:51:24.827Z] GEN 16:51:24.273 - 12 execute count Check output
[2024-11-08T16:51:24.827Z] GEN 16:51:24.273 - 13 execute Run java (Negative test) Verify if --patch-module allows replacing of module-info.class
[2024-11-08T16:51:24.827Z] GEN 16:51:24.273 - 14 execute count Check output
[2024-11-08T16:51:25.603Z] STF 16:51:24.734 -
[2024-11-08T16:51:25.603Z] STF 16:51:24.734 - Script generation completed
[2024-11-08T16:51:25.603Z] STF 16:51:24.734 -
[2024-11-08T16:51:25.603Z] STF 16:51:24.734 -
[2024-11-08T16:51:25.603Z] STF 16:51:24.734 - ======================= S E T U P =======================
[2024-11-08T16:51:25.603Z] STF 16:51:24.734 - Running setup: perl /home/jenkins/workspace/Test_openjdk17_hs_sanity.system_aarch64_linux_testList_2/aqa-tests/TKG/../TKG/output_17310791723895/PatModImg_Adv_0/20241108-165116-PatModImgTest/setUp.pl
[2024-11-08T16:51:25.603Z] STF 16:51:25.165 - SETUP stage completed
[2024-11-08T16:51:25.603Z] STF 16:51:25.168 -
[2024-11-08T16:51:25.603Z] STF 16:51:25.168 - ==================== E X E C U T E - ====================
[2024-11-08T16:51:25.603Z] STF 16:51:25.168 - Running execute: perl /home/jenkins/workspace/Test_openjdk17_hs_sanity.system_aarch64_linux_testList_2/aqa-tests/TKG/../TKG/output_17310791723895/PatModImg_Adv_0/20241108-165116-PatModImgTest/execute.pl
[2024-11-08T16:51:26.381Z] STF 16:51:25.583 -
[2024-11-08T16:51:26.381Z] STF 16:51:25.583 - Java version
[2024-11-08T16:51:26.381Z] STF 16:51:25.583 - Running: /home/jenkins/workspace/Test_openjdk17_hs_sanity.system_aarch64_linux_testList_2/jdkbinary/j2sdk-image/bin/java -version
[2024-11-08T16:51:26.381Z] openjdk version "17.0.14-beta" 2025-01-21
[2024-11-08T16:51:26.382Z] OpenJDK Runtime Environment Temurin-17.0.14+2-202411081408 (build 17.0.14-beta+2-ea)
[2024-11-08T16:51:26.382Z] OpenJDK 64-Bit Server VM Temurin-17.0.14+2-202411081408 (build 17.0.14-beta+2-ea, mixed mode, sharing)
[2024-11-08T16:51:26.382Z] STF 16:51:25.960 -
[2024-11-08T16:51:26.382Z] STF 16:51:25.960 - +------ Step 1 - Create com.hello jar
[2024-11-08T16:51:26.382Z] STF 16:51:25.960 - | Create modular jar
[2024-11-08T16:51:26.382Z] STF 16:51:25.960 - | ModuleSpec: openjdk.test.modularity/bin/common-mods/com.hello
[2024-11-08T16:51:26.382Z] STF 16:51:25.960 - | ModuleVersion: null
[2024-11-08T16:51:26.382Z] STF 16:51:25.960 - | MainClass: null
[2024-11-08T16:51:26.382Z] STF 16:51:25.960 - | HashModules: null
[2024-11-08T16:51:26.382Z] STF 16:51:25.960 - |
[2024-11-08T16:51:26.382Z] STF 16:51:25.971 - Running command: /home/jenkins/workspace/Test_openjdk17_hs_sanity.system_aarch64_linux_testList_2/jdkbinary/j2sdk-image/bin/jar --create --file /home/jenkins/workspace/Test_openjdk17_hs_sanity.system_aarch64_linux_testList_2/aqa-tests/TKG/output_17310791723895/PatModImg_Adv_0/20241108-165116-PatModImgTest/modules/1.com.hello.jar -C /home/jenkins/workspace/Test_openjdk17_hs_sanity.system_aarch64_linux_testList_2/jvmtest/system/aqa-systemtest/openjdk.test.modularity/bin/common-mods/com.hello .
[2024-11-08T16:51:26.382Z] STF 16:51:25.971 - Redirecting stderr to /home/jenkins/workspace/Test_openjdk17_hs_sanity.system_aarch64_linux_testList_2/aqa-tests/TKG/output_17310791723895/PatModImg_Adv_0/20241108-165116-PatModImgTest/results/1.CMJ.stderr
[2024-11-08T16:51:26.382Z] STF 16:51:25.971 - Redirecting stdout to /home/jenkins/workspace/Test_openjdk17_hs_sanity.system_aarch64_linux_testList_2/aqa-tests/TKG/output_17310791723895/PatModImg_Adv_0/20241108-165116-PatModImgTest/results/1.CMJ.stdout
[2024-11-08T16:51:26.382Z] STF 16:51:26.025 - Monitoring processes: CMJ
[2024-11-08T16:51:28.000Z] STF 16:51:27.421 - Monitoring Report Summary:
[2024-11-08T16:51:28.000Z] STF 16:51:27.421 - o Process CMJ ended with the expected exit code (0)
[2024-11-08T16:51:28.000Z] STF 16:51:27.421 - Created modular jar: 1.com.hello.jar
[2024-11-08T16:51:28.000Z] STF 16:51:27.421 -
[2024-11-08T16:51:28.000Z] STF 16:51:27.421 - +------ Step 2 - Create com.hola jar
[2024-11-08T16:51:28.000Z] STF 16:51:27.421 - | Create modular jar
[2024-11-08T16:51:28.000Z] STF 16:51:27.421 - | ModuleSpec: openjdk.test.modularity/bin/common-mods/com.hola
[2024-11-08T16:51:28.000Z] STF 16:51:27.421 - | ModuleVersion: null
[2024-11-08T16:51:28.000Z] STF 16:51:27.421 - | MainClass: null
[2024-11-08T16:51:28.000Z] STF 16:51:27.421 - | HashModules: null
[2024-11-08T16:51:28.000Z] STF 16:51:27.421 - |
[2024-11-08T16:51:28.000Z] STF 16:51:27.425 - Running command: /home/jenkins/workspace/Test_openjdk17_hs_sanity.system_aarch64_linux_testList_2/jdkbinary/j2sdk-image/bin/jar --create --file /home/jenkins/workspace/Test_openjdk17_hs_sanity.system_aarch64_linux_testList_2/aqa-tests/TKG/output_17310791723895/PatModImg_Adv_0/20241108-165116-PatModImgTest/modules/2.com.hola.jar -C /home/jenkins/workspace/Test_openjdk17_hs_sanity.system_aarch64_linux_testList_2/jvmtest/system/aqa-systemtest/openjdk.test.modularity/bin/common-mods/com.hola .
[2024-11-08T16:51:28.000Z] STF 16:51:27.425 - Redirecting stderr to /home/jenkins/workspace/Test_openjdk17_hs_sanity.system_aarch64_linux_testList_2/aqa-tests/TKG/output_17310791723895/PatModImg_Adv_0/20241108-165116-PatModImgTest/results/2.CMJ.stderr
[2024-11-08T16:51:28.000Z] STF 16:51:27.425 - Redirecting stdout to /home/jenkins/workspace/Test_openjdk17_hs_sanity.system_aarch64_linux_testList_2/aqa-tests/TKG/output_17310791723895/PatModImg_Adv_0/20241108-165116-PatModImgTest/results/2.CMJ.stdout
[2024-11-08T16:51:28.000Z] STF 16:51:27.426 - Monitoring processes: CMJ
[2024-11-08T16:51:29.622Z] STF 16:51:29.110 - Monitoring Report Summary:
[2024-11-08T16:51:29.622Z] STF 16:51:29.110 - o Process CMJ ended with the expected exit code (0)
[2024-11-08T16:51:29.622Z] STF 16:51:29.110 - Created modular jar: 2.com.hola.jar
[2024-11-08T16:51:29.622Z] STF 16:51:29.110 -
[2024-11-08T16:51:29.622Z] STF 16:51:29.110 - +------ Step 3 - Create com.helper jar
[2024-11-08T16:51:29.622Z] STF 16:51:29.110 - | Create modular jar
[2024-11-08T16:51:29.622Z] STF 16:51:29.110 - | ModuleSpec: openjdk.test.modularity/bin/common-mods/com.helper
[2024-11-08T16:51:29.622Z] STF 16:51:29.110 - | ModuleVersion: null
[2024-11-08T16:51:29.622Z] STF 16:51:29.110 - | MainClass: null
[2024-11-08T16:51:29.622Z] STF 16:51:29.110 - | HashModules: null
[2024-11-08T16:51:29.622Z] STF 16:51:29.110 - |
[2024-11-08T16:51:29.622Z] STF 16:51:29.111 - Running command: /home/jenkins/workspace/Test_openjdk17_hs_sanity.system_aarch64_linux_testList_2/jdkbinary/j2sdk-image/bin/jar --create --file /home/jenkins/workspace/Test_openjdk17_hs_sanity.system_aarch64_linux_testList_2/aqa-tests/TKG/output_17310791723895/PatModImg_Adv_0/20241108-165116-PatModImgTest/modules/3.com.helper.jar -C /home/jenkins/workspace/Test_openjdk17_hs_sanity.system_aarch64_linux_testList_2/jvmtest/system/aqa-systemtest/openjdk.test.modularity/bin/common-mods/com.helper .
[2024-11-08T16:51:29.622Z] STF 16:51:29.111 - Redirecting stderr to /home/jenkins/workspace/Test_openjdk17_hs_sanity.system_aarch64_linux_testList_2/aqa-tests/TKG/output_17310791723895/PatModImg_Adv_0/20241108-165116-PatModImgTest/results/3.CMJ.stderr
[2024-11-08T16:51:29.622Z] STF 16:51:29.111 - Redirecting stdout to /home/jenkins/workspace/Test_openjdk17_hs_sanity.system_aarch64_linux_testList_2/aqa-tests/TKG/output_17310791723895/PatModImg_Adv_0/20241108-165116-PatModImgTest/results/3.CMJ.stdout
[2024-11-08T16:51:29.622Z] STF 16:51:29.113 - Monitoring processes: CMJ
[2024-11-08T16:51:31.232Z] STF 16:51:30.629 - Monitoring Report Summary:
[2024-11-08T16:51:31.232Z] STF 16:51:30.629 - o Process CMJ ended with the expected exit code (0)
[2024-11-08T16:51:31.232Z] STF 16:51:30.629 - Created modular jar: 3.com.helper.jar
[2024-11-08T16:51:31.232Z] STF 16:51:30.629 -
[2024-11-08T16:51:31.232Z] STF 16:51:30.629 - +------ Step 4 - Create com.discreet jar
[2024-11-08T16:51:31.232Z] STF 16:51:30.629 - | Create modular jar
[2024-11-08T16:51:31.232Z] STF 16:51:30.629 - | ModuleSpec: openjdk.test.modularity/bin/common-mods/com.discreet
[2024-11-08T16:51:31.232Z] STF 16:51:30.629 - | ModuleVersion: null
[2024-11-08T16:51:31.232Z] STF 16:51:30.629 - | MainClass: null
[2024-11-08T16:51:31.232Z] STF 16:51:30.629 - | HashModules: null
[2024-11-08T16:51:31.232Z] STF 16:51:30.629 - |
[2024-11-08T16:51:31.232Z] STF 16:51:30.629 - Running command: /home/jenkins/workspace/Test_openjdk17_hs_sanity.system_aarch64_linux_testList_2/jdkbinary/j2sdk-image/bin/jar --create --file /home/jenkins/workspace/Test_openjdk17_hs_sanity.system_aarch64_linux_testList_2/aqa-tests/TKG/output_17310791723895/PatModImg_Adv_0/20241108-165116-PatModImgTest/modules/4.com.discreet.jar -C /home/jenkins/workspace/Test_openjdk17_hs_sanity.system_aarch64_linux_testList_2/jvmtest/system/aqa-systemtest/openjdk.test.modularity/bin/common-mods/com.discreet .
[2024-11-08T16:51:31.232Z] STF 16:51:30.629 - Redirecting stderr to /home/jenkins/workspace/Test_openjdk17_hs_sanity.system_aarch64_linux_testList_2/aqa-tests/TKG/output_17310791723895/PatModImg_Adv_0/20241108-165116-PatModImgTest/results/4.CMJ.stderr
[2024-11-08T16:51:31.232Z] STF 16:51:30.629 - Redirecting stdout to /home/jenkins/workspace/Test_openjdk17_hs_sanity.system_aarch64_linux_testList_2/aqa-tests/TKG/output_17310791723895/PatModImg_Adv_0/20241108-165116-PatModImgTest/results/4.CMJ.stdout
[2024-11-08T16:51:31.232Z] STF 16:51:30.631 - Monitoring processes: CMJ
[2024-11-08T16:51:32.853Z] STF 16:51:31.911 - Monitoring Report Summary:
[2024-11-08T16:51:32.853Z] STF 16:51:31.911 - o Process CMJ ended with the expected exit code (0)
[2024-11-08T16:51:32.853Z] STF 16:51:31.912 - Created modular jar: 4.com.discreet.jar
[2024-11-08T16:51:32.853Z] STF 16:51:31.912 -
[2024-11-08T16:51:32.853Z] STF 16:51:31.912 - +------ Step 5 - Create tests jar
[2024-11-08T16:51:32.853Z] STF 16:51:31.912 - | Create modular jar
[2024-11-08T16:51:32.853Z] STF 16:51:31.912 - | ModuleSpec: openjdk.test.modularity/bin/tests/com.test
[2024-11-08T16:51:32.853Z] STF 16:51:31.912 - | ModuleVersion: null
[2024-11-08T16:51:32.853Z] STF 16:51:31.912 - | MainClass: null
[2024-11-08T16:51:32.853Z] STF 16:51:31.912 - | HashModules: null
[2024-11-08T16:51:32.853Z] STF 16:51:31.912 - |
[2024-11-08T16:51:32.853Z] STF 16:51:31.912 - Running command: /home/jenkins/workspace/Test_openjdk17_hs_sanity.system_aarch64_linux_testList_2/jdkbinary/j2sdk-image/bin/jar --create --file /home/jenkins/workspace/Test_openjdk17_hs_sanity.system_aarch64_linux_testList_2/aqa-tests/TKG/output_17310791723895/PatModImg_Adv_0/20241108-165116-PatModImgTest/modules/5.com.test.jar -C /home/jenkins/workspace/Test_openjdk17_hs_sanity.system_aarch64_linux_testList_2/jvmtest/system/aqa-systemtest/openjdk.test.modularity/bin/tests/com.test .
[2024-11-08T16:51:32.853Z] STF 16:51:31.912 - Redirecting stderr to /home/jenkins/workspace/Test_openjdk17_hs_sanity.system_aarch64_linux_testList_2/aqa-tests/TKG/output_17310791723895/PatModImg_Adv_0/20241108-165116-PatModImgTest/results/5.CMJ.stderr
[2024-11-08T16:51:32.853Z] STF 16:51:31.912 - Redirecting stdout to /home/jenkins/workspace/Test_openjdk17_hs_sanity.system_aarch64_linux_testList_2/aqa-tests/TKG/output_17310791723895/PatModImg_Adv_0/20241108-165116-PatModImgTest/results/5.CMJ.stdout
[2024-11-08T16:51:32.853Z] STF 16:51:31.914 - Monitoring processes: CMJ
[2024-11-08T16:51:34.464Z] STF 16:51:33.764 - Monitoring Report Summary:
[2024-11-08T16:51:34.464Z] STF 16:51:33.764 - o Process CMJ ended with the expected exit code (0)
[2024-11-08T16:51:34.464Z] STF 16:51:33.764 - Created modular jar: 5.com.test.jar
[2024-11-08T16:51:34.464Z] STF 16:51:33.764 -
[2024-11-08T16:51:34.464Z] STF 16:51:33.764 - +------ Step 6 - Create runtime image for PatchModule test
[2024-11-08T16:51:34.464Z] STF 16:51:33.764 - | Run jlink to create runtime image
[2024-11-08T16:51:34.464Z] STF 16:51:33.764 - | ImageName: XpJVM
[2024-11-08T16:51:34.464Z] STF 16:51:33.764 - |
[2024-11-08T16:51:34.464Z] STF 16:51:33.764 - Running command: /home/jenkins/workspace/Test_openjdk17_hs_sanity.system_aarch64_linux_testList_2/jdkbinary/j2sdk-image/bin/jlink --module-path /home/jenkins/workspace/Test_openjdk17_hs_sanity.system_aarch64_linux_testList_2/jdkbinary/j2sdk-image/jmods:/home/jenkins/workspace/Test_openjdk17_hs_sanity.system_aarch64_linux_testList_2/aqa-tests/TKG/output_17310791723895/PatModImg_Adv_0/20241108-165116-PatModImgTest/modules --add-modules com.hello,com.hola,com.test,com.helper,com.discreet --output /home/jenkins/workspace/Test_openjdk17_hs_sanity.system_aarch64_linux_testList_2/aqa-tests/TKG/output_17310791723895/PatModImg_Adv_0/20241108-165116-PatModImgTest/tmp/6.XpJVM
[2024-11-08T16:51:34.464Z] STF 16:51:33.764 - Redirecting stderr to /home/jenkins/workspace/Test_openjdk17_hs_sanity.system_aarch64_linux_testList_2/aqa-tests/TKG/output_17310791723895/PatModImg_Adv_0/20241108-165116-PatModImgTest/results/6.JLNK.stderr
[2024-11-08T16:51:34.464Z] STF 16:51:33.764 - Redirecting stdout to /home/jenkins/workspace/Test_openjdk17_hs_sanity.system_aarch64_linux_testList_2/aqa-tests/TKG/output_17310791723895/PatModImg_Adv_0/20241108-165116-PatModImgTest/results/6.JLNK.stdout
[2024-11-08T16:51:34.464Z] STF 16:51:33.766 - Monitoring processes: JLNK
[2024-11-08T16:51:53.436Z] STF 16:51:51.316 - Monitoring Report Summary:
[2024-11-08T16:51:53.436Z] STF 16:51:51.317 - o Process JLNK ended with the expected exit code (0)
[2024-11-08T16:51:53.436Z] STF 16:51:51.318 -
[2024-11-08T16:51:53.436Z] STF 16:51:51.318 - +------ Step 7 - Create com.hello jar
[2024-11-08T16:51:53.436Z] STF 16:51:51.318 - | Create modular jar
[2024-11-08T16:51:53.436Z] STF 16:51:51.318 - | ModuleSpec: openjdk.test.modularity/bin/common-override/com.hello
[2024-11-08T16:51:53.436Z] STF 16:51:51.318 - | ModuleVersion: null
[2024-11-08T16:51:53.436Z] STF 16:51:51.318 - | MainClass: null
[2024-11-08T16:51:53.436Z] STF 16:51:51.318 - | HashModules: null
[2024-11-08T16:51:53.436Z] STF 16:51:51.318 - |
[2024-11-08T16:51:53.436Z] STF 16:51:51.318 - Running command: /home/jenkins/workspace/Test_openjdk17_hs_sanity.system_aarch64_linux_testList_2/jdkbinary/j2sdk-image/bin/jar --create --file /home/jenkins/workspace/Test_openjdk17_hs_sanity.system_aarch64_linux_testList_2/aqa-tests/TKG/output_17310791723895/PatModImg_Adv_0/20241108-165116-PatModImgTest/modules/7.com.hello.jar -C /home/jenkins/workspace/Test_openjdk17_hs_sanity.system_aarch64_linux_testList_2/jvmtest/system/aqa-systemtest/openjdk.test.modularity/bin/common-override/com.hello .
[2024-11-08T16:51:53.436Z] STF 16:51:51.318 - Redirecting stderr to /home/jenkins/workspace/Test_openjdk17_hs_sanity.system_aarch64_linux_testList_2/aqa-tests/TKG/output_17310791723895/PatModImg_Adv_0/20241108-165116-PatModImgTest/results/7.CMJ.stderr
[2024-11-08T16:51:53.436Z] STF 16:51:51.318 - Redirecting stdout to /home/jenkins/workspace/Test_openjdk17_hs_sanity.system_aarch64_linux_testList_2/aqa-tests/TKG/output_17310791723895/PatModImg_Adv_0/20241108-165116-PatModImgTest/results/7.CMJ.stdout
[2024-11-08T16:51:53.436Z] STF 16:51:51.320 - Monitoring processes: CMJ
[2024-11-08T16:51:53.436Z] STF 16:51:52.482 - Monitoring Report Summary:
[2024-11-08T16:51:53.436Z] STF 16:51:52.482 - o Process CMJ ended with the expected exit code (0)
[2024-11-08T16:51:53.436Z] STF 16:51:52.483 - Created modular jar: 7.com.hello.jar
[2024-11-08T16:51:53.436Z] STF 16:51:52.483 -
[2024-11-08T16:51:53.436Z] STF 16:51:52.483 - +------ Step 8 - create java.xml.jar
[2024-11-08T16:51:53.436Z] STF 16:51:52.483 - | Create modular jar
[2024-11-08T16:51:53.436Z] STF 16:51:52.483 - | ModuleSpec: openjdk.test.modularity/bin/common-override/java.xml
[2024-11-08T16:51:53.436Z] STF 16:51:52.483 - | ModuleVersion: null
[2024-11-08T16:51:53.436Z] STF 16:51:52.483 - | MainClass: null
[2024-11-08T16:51:53.436Z] STF 16:51:52.483 - | HashModules: null
[2024-11-08T16:51:53.436Z] STF 16:51:52.483 - |
[2024-11-08T16:51:53.436Z] STF 16:51:52.483 - Running command: /home/jenkins/workspace/Test_openjdk17_hs_sanity.system_aarch64_linux_testList_2/jdkbinary/j2sdk-image/bin/jar --create --file /home/jenkins/workspace/Test_openjdk17_hs_sanity.system_aarch64_linux_testList_2/aqa-tests/TKG/output_17310791723895/PatModImg_Adv_0/20241108-165116-PatModImgTest/modules/8.java.xml.jar -C /home/jenkins/workspace/Test_openjdk17_hs_sanity.system_aarch64_linux_testList_2/jvmtest/system/aqa-systemtest/openjdk.test.modularity/bin/common-override/java.xml .
[2024-11-08T16:51:53.436Z] STF 16:51:52.483 - Redirecting stderr to /home/jenkins/workspace/Test_openjdk17_hs_sanity.system_aarch64_linux_testList_2/aqa-tests/TKG/output_17310791723895/PatModImg_Adv_0/20241108-165116-PatModImgTest/results/8.CMJ.stderr
[2024-11-08T16:51:53.436Z] STF 16:51:52.483 - Redirecting stdout to /home/jenkins/workspace/Test_openjdk17_hs_sanity.system_aarch64_linux_testList_2/aqa-tests/TKG/output_17310791723895/PatModImg_Adv_0/20241108-165116-PatModImgTest/results/8.CMJ.stdout
[2024-11-08T16:51:53.436Z] STF 16:51:52.485 - Monitoring processes: CMJ
[2024-11-08T16:51:54.227Z] STF 16:51:53.868 - Monitoring Report Summary:
[2024-11-08T16:51:54.227Z] STF 16:51:53.868 - o Process CMJ ended with the expected exit code (0)
[2024-11-08T16:51:54.227Z] STF 16:51:53.868 - Created modular jar: 8.java.xml.jar
[2024-11-08T16:51:54.227Z] STF 16:51:53.868 -
[2024-11-08T16:51:54.227Z] STF 16:51:53.868 - +------ Step 9 - Run application class override test where we specify two exploded module paths in a single --patch-module option
[2024-11-08T16:51:54.227Z] STF 16:51:53.868 - | Run foreground process
[2024-11-08T16:51:54.227Z] STF 16:51:53.868 - | Program: /home/jenkins/workspace/Test_openjdk17_hs_sanity.system_aarch64_linux_testList_2/aqa-tests/TKG/output_17310791723895/PatModImg_Adv_0/20241108-165116-PatModImgTest/tmp/6.XpJVM/bin/java
[2024-11-08T16:51:54.227Z] STF 16:51:53.868 - | Mnemonic: OT1
[2024-11-08T16:51:54.227Z] STF 16:51:53.868 - | Echo: ECHO_ON
[2024-11-08T16:51:54.227Z] STF 16:51:53.868 - | Expectation: CLEAN_RUN within 5m
[2024-11-08T16:51:54.227Z] STF 16:51:53.868 - |
[2024-11-08T16:51:54.227Z] STF 16:51:53.868 - Running command: /home/jenkins/workspace/Test_openjdk17_hs_sanity.system_aarch64_linux_testList_2/aqa-tests/TKG/output_17310791723895/PatModImg_Adv_0/20241108-165116-PatModImgTest/tmp/6.XpJVM/bin/java --add-reads com.test=ALL-UNNAMED --add-exports com.hello/adoptopenjdk.test.modularity.newpkg=com.test --patch-module com.hello=/home/jenkins/workspace/Test_openjdk17_hs_sanity.system_aarch64_linux_testList_2/jvmtest/system/aqa-systemtest/openjdk.test.modularity/bin/common-override/com.hello:/home/jenkins/workspace/Test_openjdk17_hs_sanity.system_aarch64_linux_testList_2/jvmtest/system/aqa-systemtest/openjdk.test.modularity/bin/common-override-new/com.hello -XX:+UseCompressedOops -classpath /home/jenkins/testDependency/system_lib/junit/junit.jar:/home/jenkins/testDependency/system_lib/junit/hamcrest-core.jar org.junit.runner.JUnitCore net.adoptopenjdk.test.modularity.junit.TestOverrideUsingMultipleFilePaths
[2024-11-08T16:51:54.227Z] STF 16:51:53.868 - Redirecting stderr to /home/jenkins/workspace/Test_openjdk17_hs_sanity.system_aarch64_linux_testList_2/aqa-tests/TKG/output_17310791723895/PatModImg_Adv_0/20241108-165116-PatModImgTest/results/9.OT1.stderr
[2024-11-08T16:51:54.227Z] STF 16:51:53.868 - Redirecting stdout to /home/jenkins/workspace/Test_openjdk17_hs_sanity.system_aarch64_linux_testList_2/aqa-tests/TKG/output_17310791723895/PatModImg_Adv_0/20241108-165116-PatModImgTest/results/9.OT1.stdout
[2024-11-08T16:51:54.227Z] STF 16:51:53.870 - Monitoring processes: OT1
[2024-11-08T16:51:54.999Z] OT1 stderr WARNING: module-info.class ignored in patch: /home/jenkins/workspace/Test_openjdk17_hs_sanity.system_aarch64_linux_testList_2/jvmtest/system/aqa-systemtest/openjdk.test.modularity/bin/common-override/com.hello
[2024-11-08T16:51:54.999Z] OT1 stderr WARNING: module-info.class ignored in patch: /home/jenkins/workspace/Test_openjdk17_hs_sanity.system_aarch64_linux_testList_2/jvmtest/system/aqa-systemtest/openjdk.test.modularity/bin/common-override-new/com.hello
[2024-11-08T16:51:55.781Z] OT1 JUnit version 4.12
[2024-11-08T16:51:56.560Z] OT1 ...
[2024-11-08T16:51:56.560Z] OT1 Time: 0.109
[2024-11-08T16:51:56.560Z] OT1
[2024-11-08T16:51:56.560Z] OT1 OK (3 tests)
[2024-11-08T16:51:56.560Z] OT1
[2024-11-08T16:51:56.560Z] STF 16:51:55.872 - Monitoring Report Summary:
[2024-11-08T16:51:56.560Z] STF 16:51:55.872 - o Process OT1 ended with the expected exit code (0)
[2024-11-08T16:51:56.560Z] STF 16:51:55.872 -
[2024-11-08T16:51:56.560Z] STF 16:51:55.872 - +------ Step 10 - Verify if a module can be specified only once on --patch-module
[2024-11-08T16:51:56.560Z] STF 16:51:55.872 - | Run foreground process
[2024-11-08T16:51:56.560Z] STF 16:51:55.872 - | Program: /home/jenkins/workspace/Test_openjdk17_hs_sanity.system_aarch64_linux_testList_2/aqa-tests/TKG/output_17310791723895/PatModImg_Adv_0/20241108-165116-PatModImgTest/tmp/6.XpJVM/bin/java
[2024-11-08T16:51:56.560Z] STF 16:51:55.872 - | Mnemonic: OT7
[2024-11-08T16:51:56.560Z] STF 16:51:55.872 - | Echo: ECHO_ON
[2024-11-08T16:51:56.560Z] STF 16:51:55.872 - | Expectation: NON_ZERO_EXIT [1] within 5m
[2024-11-08T16:51:56.560Z] STF 16:51:55.872 - |
[2024-11-08T16:51:56.560Z] STF 16:51:55.873 - Running command: /home/jenkins/workspace/Test_openjdk17_hs_sanity.system_aarch64_linux_testList_2/aqa-tests/TKG/output_17310791723895/PatModImg_Adv_0/20241108-165116-PatModImgTest/tmp/6.XpJVM/bin/java --add-reads com.test=ALL-UNNAMED --patch-module com.hello=/home/jenkins/workspace/Test_openjdk17_hs_sanity.system_aarch64_linux_testList_2/jvmtest/system/aqa-systemtest/openjdk.test.modularity/bin/common-override-new/com.hello --patch-module com.hello=/home/jenkins/workspace/Test_openjdk17_hs_sanity.system_aarch64_linux_testList_2/jvmtest/system/aqa-systemtest/openjdk.test.modularity/bin/common-override/com.hello -XX:+UseCompressedOops -classpath /home/jenkins/testDependency/system_lib/junit/junit.jar:/home/jenkins/testDependency/system_lib/junit/hamcrest-core.jar org.junit.runner.JUnitCore net.adoptopenjdk.test.modularity.junit.TestOverrideUsingAppModule
[2024-11-08T16:51:56.560Z] STF 16:51:55.873 - Redirecting stderr to /home/jenkins/workspace/Test_openjdk17_hs_sanity.system_aarch64_linux_testList_2/aqa-tests/TKG/output_17310791723895/PatModImg_Adv_0/20241108-165116-PatModImgTest/results/10.OT7.stderr
[2024-11-08T16:51:56.560Z] STF 16:51:55.873 - Redirecting stdout to /home/jenkins/workspace/Test_openjdk17_hs_sanity.system_aarch64_linux_testList_2/aqa-tests/TKG/output_17310791723895/PatModImg_Adv_0/20241108-165116-PatModImgTest/results/10.OT7.stdout
[2024-11-08T16:51:56.560Z] STF 16:51:55.875 - Monitoring processes: OT7
[2024-11-08T16:51:57.344Z] OT7 Error occurred during initialization of boot layer
[2024-11-08T16:51:57.344Z] OT7 java.lang.ExceptionInInitializerError
[2024-11-08T16:51:57.344Z] OT7 Caused by: java.lang.RuntimeException: com.hello specified more than once to --patch-module
[2024-11-08T16:51:57.344Z] STF 16:51:56.510 - Monitoring Report Summary:
[2024-11-08T16:51:57.344Z] STF 16:51:56.510 - o Process OT7 ended with the expected exit code (1)
[2024-11-08T16:51:57.344Z] STF 16:51:56.511 -
[2024-11-08T16:51:57.344Z] STF 16:51:56.511 - +------ Step 11 - Combine stderr and stdout files of process OT7
[2024-11-08T16:51:57.344Z] STF 16:51:56.511 - | Run foreground process
[2024-11-08T16:51:57.344Z] STF 16:51:56.511 - | Program: /home/jenkins/workspace/Test_openjdk17_hs_sanity.system_aarch64_linux_testList_2/jdkbinary/j2sdk-image/bin/java
[2024-11-08T16:51:57.344Z] STF 16:51:56.511 - | Mnemonic: CO
[2024-11-08T16:51:57.344Z] STF 16:51:56.511 - | Echo: ECHO_OFF
[2024-11-08T16:51:57.344Z] STF 16:51:56.511 - | Expectation: NON_ZERO_EXIT [0] within 30s
[2024-11-08T16:51:57.344Z] STF 16:51:56.511 - |
[2024-11-08T16:51:57.344Z] STF 16:51:56.511 - Running command: /home/jenkins/workspace/Test_openjdk17_hs_sanity.system_aarch64_linux_testList_2/jdkbinary/j2sdk-image/bin/java -Dfile1=/home/jenkins/workspace/Test_openjdk17_hs_sanity.system_aarch64_linux_testList_2/aqa-tests/TKG/output_17310791723895/PatModImg_Adv_0/20241108-165116-PatModImgTest/results/10.OT7.stdout -Dfile2=/home/jenkins/workspace/Test_openjdk17_hs_sanity.system_aarch64_linux_testList_2/aqa-tests/TKG/output_17310791723895/PatModImg_Adv_0/20241108-165116-PatModImgTest/results/10.OT7.stderr -Dfinal.file=/home/jenkins/workspace/Test_openjdk17_hs_sanity.system_aarch64_linux_testList_2/aqa-tests/TKG/output_17310791723895/PatModImg_Adv_0/20241108-165116-PatModImgTest/results/combinedOT7.txt -XX:+UseCompressedOops -classpath /home/jenkins/workspace/Test_openjdk17_hs_sanity.system_aarch64_linux_testList_2/jvmtest/system/STF/stf.core/bin:/home/jenkins/workspace/Test_openjdk17_hs_sanity.system_aarch64_linux_testList_2/jvmtest/system/aqa-systemtest/openjdk.test.modularity/bin net.adoptopenjdk.test.modularity.TestUtil
[2024-11-08T16:51:57.344Z] STF 16:51:56.511 - Redirecting stderr to /home/jenkins/workspace/Test_openjdk17_hs_sanity.system_aarch64_linux_testList_2/aqa-tests/TKG/output_17310791723895/PatModImg_Adv_0/20241108-165116-PatModImgTest/results/11.CO.stderr
[2024-11-08T16:51:57.344Z] STF 16:51:56.511 - Redirecting stdout to /home/jenkins/workspace/Test_openjdk17_hs_sanity.system_aarch64_linux_testList_2/aqa-tests/TKG/output_17310791723895/PatModImg_Adv_0/20241108-165116-PatModImgTest/results/11.CO.stdout
[2024-11-08T16:51:57.344Z] STF 16:51:56.513 - Monitoring processes: CO
[2024-11-08T16:51:58.123Z] STF 16:51:57.165 - Monitoring Report Summary:
[2024-11-08T16:51:58.123Z] STF 16:51:57.165 - o Process CO ended with the expected exit code (0)
[2024-11-08T16:51:58.123Z] STF 16:51:57.165 -
[2024-11-08T16:51:58.123Z] STF 16:51:57.165 - +------ Step 12 - Check output
[2024-11-08T16:51:58.123Z] STF 16:51:57.165 - | Count file matches
[2024-11-08T16:51:58.123Z] STF 16:51:57.165 - | TargetFile: /home/jenkins/workspace/Test_openjdk17_hs_sanity.system_aarch64_linux_testList_2/aqa-tests/TKG/output_17310791723895/PatModImg_Adv_0/20241108-165116-PatModImgTest/results/combinedOT7.txt
[2024-11-08T16:51:58.123Z] STF 16:51:57.165 - | ExpectedNumMatches: 1
[2024-11-08T16:51:58.123Z] STF 16:51:57.165 - | SearchStrings: ["java.lang.ExceptionInInitializerError"]
[2024-11-08T16:51:58.123Z] STF 16:51:57.165 - |
[2024-11-08T16:51:58.123Z] STF 16:51:57.166 - Found 1 instances of ["java.lang.ExceptionInInitializerError"]
[2024-11-08T16:51:58.123Z] STF 16:51:57.166 -
[2024-11-08T16:51:58.123Z] STF 16:51:57.166 - +------ Step 13 - (Negative test) Verify if --patch-module allows replacing of module-info.class
[2024-11-08T16:51:58.123Z] STF 16:51:57.166 - | Run foreground process
[2024-11-08T16:51:58.123Z] STF 16:51:57.166 - | Program: /home/jenkins/workspace/Test_openjdk17_hs_sanity.system_aarch64_linux_testList_2/aqa-tests/TKG/output_17310791723895/PatModImg_Adv_0/20241108-165116-PatModImgTest/tmp/6.XpJVM/bin/java
[2024-11-08T16:51:58.123Z] STF 16:51:57.166 - | Mnemonic: OT8
[2024-11-08T16:51:58.123Z] STF 16:51:57.166 - | Echo: ECHO_ON
[2024-11-08T16:51:58.123Z] STF 16:51:57.166 - | Expectation: NON_ZERO_EXIT [1] within 5m
[2024-11-08T16:51:58.123Z] STF 16:51:57.166 - |
[2024-11-08T16:51:58.123Z] STF 16:51:57.166 - Running command: /home/jenkins/workspace/Test_openjdk17_hs_sanity.system_aarch64_linux_testList_2/aqa-tests/TKG/output_17310791723895/PatModImg_Adv_0/20241108-165116-PatModImgTest/tmp/6.XpJVM/bin/java --add-reads com.test=ALL-UNNAMED --patch-module com.hello=/home/jenkins/workspace/Test_openjdk17_hs_sanity.system_aarch64_linux_testList_2/jvmtest/system/aqa-systemtest/openjdk.test.modularity/bin/common-override-new/com.hello -XX:+UseCompressedOops -classpath /home/jenkins/testDependency/system_lib/junit/junit.jar:/home/jenkins/testDependency/system_lib/junit/hamcrest-core.jar org.junit.runner.JUnitCore net.adoptopenjdk.test.modularity.junit.TestOverrideUsingUnexportedPublicType
[2024-11-08T16:51:58.123Z] STF 16:51:57.166 - Redirecting stderr to /home/jenkins/workspace/Test_openjdk17_hs_sanity.system_aarch64_linux_testList_2/aqa-tests/TKG/output_17310791723895/PatModImg_Adv_0/20241108-165116-PatModImgTest/results/13.OT8.stderr
[2024-11-08T16:51:58.123Z] STF 16:51:57.166 - Redirecting stdout to /home/jenkins/workspace/Test_openjdk17_hs_sanity.system_aarch64_linux_testList_2/aqa-tests/TKG/output_17310791723895/PatModImg_Adv_0/20241108-165116-PatModImgTest/results/13.OT8.stdout
[2024-11-08T16:51:58.123Z] STF 16:51:57.167 - Monitoring processes: OT8
[2024-11-08T16:51:58.901Z] OT8 stderr WARNING: module-info.class ignored in patch: /home/jenkins/workspace/Test_openjdk17_hs_sanity.system_aarch64_linux_testList_2/jvmtest/system/aqa-systemtest/openjdk.test.modularity/bin/common-override-new/com.hello
[2024-11-08T16:51:58.901Z] OT8 JUnit version 4.12
[2024-11-08T16:52:00.495Z] OT8 .E
[2024-11-08T16:52:00.495Z] OT8 Time: 0.092
[2024-11-08T16:52:00.495Z] OT8 There was 1 failure:
[2024-11-08T16:52:00.495Z] OT8 1) testPatchingOfNewClassInExistingPackage(net.adoptopenjdk.test.modularity.junit.TestOverrideUsingUnexportedPublicType)
[2024-11-08T16:52:00.495Z] OT8 java.lang.IllegalAccessException: class net.adoptopenjdk.test.modularity.junit.TestOverrideUsingUnexportedPublicType (in module com.test) cannot access class adoptopenjdk.test.modularity.newpkg.NewClass2 (in module com.hello) because module com.hello does not export adoptopenjdk.test.modularity.newpkg to module com.test
[2024-11-08T16:52:00.495Z] OT8 at java.base/jdk.internal.reflect.Reflection.newIllegalAccessException(Reflection.java:392)
[2024-11-08T16:52:00.495Z] OT8 at java.base/java.lang.reflect.AccessibleObject.checkAccess(AccessibleObject.java:674)
[2024-11-08T16:52:00.495Z] OT8 at java.base/java.lang.reflect.Constructor.newInstanceWithCaller(Constructor.java:490)
[2024-11-08T16:52:00.495Z] OT8 at java.base/java.lang.reflect.Constructor.newInstance(Constructor.java:481)
[2024-11-08T16:52:00.495Z] OT8 at com.test/net.adoptopenjdk.test.modularity.junit.TestOverrideUsingUnexportedPublicType.testPatchingOfNewClassInExistingPackage(TestOverrideUsingUnexportedPublicType.java:34)
[2024-11-08T16:52:00.495Z] OT8 at java.base/jdk.internal.reflect.NativeMethodAccessorImpl.invoke0(Native Method)
[2024-11-08T16:52:00.495Z] OT8 at java.base/jdk.internal.reflect.NativeMethodAccessorImpl.invoke(NativeMethodAccessorImpl.java:77)
[2024-11-08T16:52:00.495Z] OT8 at java.base/jdk.internal.reflect.DelegatingMethodAccessorImpl.invoke(DelegatingMethodAccessorImpl.java:43)
[2024-11-08T16:52:00.495Z] OT8 at java.base/java.lang.reflect.Method.invoke(Method.java:569)
[2024-11-08T16:52:00.495Z] OT8 at org.junit.runners.model.FrameworkMethod$1.runReflectiveCall(FrameworkMethod.java:50)
[2024-11-08T16:52:00.495Z] OT8 at org.junit.internal.runners.model.ReflectiveCallable.run(ReflectiveCallable.java:12)
[2024-11-08T16:52:00.495Z] OT8 at org.junit.runners.model.FrameworkMethod.invokeExplosively(FrameworkMethod.java:47)
[2024-11-08T16:52:00.495Z] OT8 at org.junit.internal.runners.statements.InvokeMethod.evaluate(InvokeMethod.java:17)
[2024-11-08T16:52:00.495Z] OT8 at org.junit.runners.ParentRunner.runLeaf(ParentRunner.java:325)
[2024-11-08T16:52:00.495Z] OT8 at org.junit.runners.BlockJUnit4ClassRunner.runChild(BlockJUnit4ClassRunner.java:78)
[2024-11-08T16:52:00.495Z] OT8 at org.junit.runners.BlockJUnit4ClassRunner.runChild(BlockJUnit4ClassRunner.java:57)
[2024-11-08T16:52:00.495Z] OT8 at org.junit.runners.ParentRunner$3.run(ParentRunner.java:290)
[2024-11-08T16:52:00.495Z] OT8 at org.junit.runners.ParentRunner$1.schedule(ParentRunner.java:71)
[2024-11-08T16:52:00.495Z] OT8 at org.junit.runners.ParentRunner.runChildren(ParentRunner.java:288)
[2024-11-08T16:52:00.495Z] OT8 at org.junit.runners.ParentRunner.access$000(ParentRunner.java:58)
[2024-11-08T16:52:00.495Z] OT8 at org.junit.runners.ParentRunner$2.evaluate(ParentRunner.java:268)
[2024-11-08T16:52:00.495Z] OT8 at org.junit.runners.ParentRunner.run(ParentRunner.java:363)
[2024-11-08T16:52:00.495Z] OT8 at org.junit.runners.Suite.runChild(Suite.java:128)
[2024-11-08T16:52:00.495Z] OT8 at org.junit.runners.Suite.runChild(Suite.java:27)
[2024-11-08T16:52:00.495Z] OT8 at org.junit.runners.ParentRunner$3.run(ParentRunner.java:290)
[2024-11-08T16:52:00.495Z] OT8 at org.junit.runners.ParentRunner$1.schedule(ParentRunner.java:71)
[2024-11-08T16:52:00.495Z] OT8 at org.junit.runners.ParentRunner.runChildren(ParentRunner.java:288)
[2024-11-08T16:52:00.495Z] OT8 at org.junit.runners.ParentRunner.access$000(ParentRunner.java:58)
[2024-11-08T16:52:00.495Z] OT8 at org.junit.runners.ParentRunner$2.evaluate(ParentRunner.java:268)
[2024-11-08T16:52:00.495Z] OT8 at org.junit.runners.ParentRunner.run(ParentRunner.java:363)
[2024-11-08T16:52:00.495Z] OT8 at org.junit.runner.JUnitCore.run(JUnitCore.java:137)
[2024-11-08T16:52:00.495Z] OT8 at org.junit.runner.JUnitCore.run(JUnitCore.java:115)
[2024-11-08T16:52:00.495Z] OT8 at org.junit.runner.JUnitCore.runMain(JUnitCore.java:77)
[2024-11-08T16:52:00.495Z] OT8 at org.junit.runner.JUnitCore.main(JUnitCore.java:36)
[2024-11-08T16:52:00.495Z] OT8
[2024-11-08T16:52:00.495Z] OT8 FAILURES!!!
[2024-11-08T16:52:00.495Z] OT8 Tests run: 1, Failures: 1
[2024-11-08T16:52:00.495Z] OT8
[2024-11-08T16:52:00.495Z] STF 16:51:59.609 - Monitoring Report Summary:
[2024-11-08T16:52:00.495Z] STF 16:51:59.609 - o Process OT8 ended with the expected exit code (1)
[2024-11-08T16:52:00.495Z] STF 16:51:59.609 -
[2024-11-08T16:52:00.495Z] STF 16:51:59.609 - +------ Step 14 - Check output
[2024-11-08T16:52:00.495Z] STF 16:51:59.609 - | Count file matches
[2024-11-08T16:52:00.495Z] STF 16:51:59.609 - | TargetFile: /home/jenkins/workspace/Test_openjdk17_hs_sanity.system_aarch64_linux_testList_2/aqa-tests/TKG/output_17310791723895/PatModImg_Adv_0/20241108-165116-PatModImgTest/results/13.OT8.stdout
[2024-11-08T16:52:00.495Z] STF 16:51:59.609 - | ExpectedNumMatches: 1
[2024-11-08T16:52:00.495Z] STF 16:51:59.609 - | SearchStrings: ["java.lang.IllegalAccessException"]
[2024-11-08T16:52:00.495Z] STF 16:51:59.609 - |
[2024-11-08T16:52:00.495Z] STF 16:51:59.610 - Found 1 instances of ["java.lang.IllegalAccessException"]
[2024-11-08T16:52:00.495Z] STF 16:51:59.610 - EXECUTE stage completed
[2024-11-08T16:52:00.495Z] STF 16:51:59.734 -
[2024-11-08T16:52:00.495Z] STF 16:51:59.734 - ==================== T E A R D O W N ====================
[2024-11-08T16:52:00.495Z] STF 16:51:59.734 - Running teardown: perl /home/jenkins/workspace/Test_openjdk17_hs_sanity.system_aarch64_linux_testList_2/aqa-tests/TKG/../TKG/output_17310791723895/PatModImg_Adv_0/20241108-165116-PatModImgTest/tearDown.pl
[2024-11-08T16:52:00.495Z] STF 16:51:59.969 - TEARDOWN stage completed
[2024-11-08T16:52:00.495Z] STF 16:51:59.985 -
[2024-11-08T16:52:00.495Z] STF 16:51:59.985 - ===================== R E S U L T S =====================
[2024-11-08T16:52:00.495Z] STF 16:51:59.985 - Stage results:
[2024-11-08T16:52:00.495Z] STF 16:51:59.985 - setUp: pass
[2024-11-08T16:52:00.495Z] STF 16:51:59.985 - execute: pass
[2024-11-08T16:52:00.495Z] STF 16:51:59.985 - teardown: pass
[2024-11-08T16:52:00.495Z] STF 16:51:59.985 -
[2024-11-08T16:52:00.495Z] STF 16:51:59.985 - Overall result: PASSED
[2024-11-08T16:52:00.495Z] -----------------------------------
[2024-11-08T16:52:00.495Z] PatModImg_Adv_0_PASSED
[2024-11-08T16:52:00.495Z] -----------------------------------
[2024-11-08T16:52:00.495Z]
[2024-11-08T16:52:00.495Z] TEST TEARDOWN:
[2024-11-08T16:52:00.495Z] Nothing to be done for teardown.
[2024-11-08T16:52:00.495Z] PatModImg_Adv_0 Finish Time: Fri Nov 8 16:52:00 2024 Epoch Time (ms): 1731084720138