jdk_jmx_2
[2024-11-14T04:55:43.954Z] Running test jdk_jmx_2 ...
[2024-11-14T04:55:43.954Z] ===============================================
[2024-11-14T04:55:43.954Z] jdk_jmx_2 Start Time: Thu Nov 14 04:55:43 2024 Epoch Time (ms): 1731560143545
[2024-11-14T04:55:43.954Z] variation: Mode1000
[2024-11-14T04:55:43.954Z] JVM_OPTIONS:
[2024-11-14T04:55:43.954Z] { \
[2024-11-14T04:55:43.954Z] echo ""; echo "TEST SETUP:"; \
[2024-11-14T04:55:43.954Z] echo "Nothing to be done for setup."; \
[2024-11-14T04:55:43.954Z] mkdir -p "/home/jenkins/workspace/Test_openjdk11_hs_extended.openjdk_arm_linux_testList_2/aqa-tests/TKG/../TKG/output_17315397621362/jdk_jmx_2"; \
[2024-11-14T04:55:43.954Z] cd "/home/jenkins/workspace/Test_openjdk11_hs_extended.openjdk_arm_linux_testList_2/aqa-tests/TKG/../TKG/output_17315397621362/jdk_jmx_2"; \
[2024-11-14T04:55:43.954Z] echo ""; echo "TESTING:"; \
[2024-11-14T04:55:43.954Z] "/home/jenkins/workspace/Test_openjdk11_hs_extended.openjdk_arm_linux_testList_2/jdkbinary/j2sdk-image/bin/java" -Xmx512m -jar "/home/jenkins/workspace/Test_openjdk11_hs_extended.openjdk_arm_linux_testList_2/aqa-tests/TKG/../../jvmtest/openjdk/jtreg/lib/jtreg.jar" \
[2024-11-14T04:55:43.954Z] -agentvm -a -ea -esa -v:fail,error,time,nopass -retain:fail,error,*.dmp,javacore.*,heapdump.*,*.trc -ignore:quiet -timeoutFactor:8 -xml:verify -concurrency:81 -nativepath:"/home/jenkins/workspace/Test_openjdk11_hs_extended.openjdk_arm_linux_testList_2/jdkbinary/openjdk-test-image/jdk/jtreg/native" -vmoptions:"-Xmx512m " \
[2024-11-14T04:55:43.954Z] -w ""/home/jenkins/workspace/Test_openjdk11_hs_extended.openjdk_arm_linux_testList_2/aqa-tests/TKG/../TKG/output_17315397621362/jdk_jmx_2"/work" \
[2024-11-14T04:55:43.954Z] -r ""/home/jenkins/workspace/Test_openjdk11_hs_extended.openjdk_arm_linux_testList_2/aqa-tests/TKG/../TKG/output_17315397621362/jdk_jmx_2"/report" \
[2024-11-14T04:55:43.954Z] -jdk:"/home/jenkins/workspace/Test_openjdk11_hs_extended.openjdk_arm_linux_testList_2/jdkbinary/j2sdk-image" \
[2024-11-14T04:55:43.954Z] -exclude:"/home/jenkins/workspace/Test_openjdk11_hs_extended.openjdk_arm_linux_testList_2/aqa-tests/TKG/../openjdk/openjdk-jdk/test/jdk/ProblemList.txt" \
[2024-11-14T04:55:43.954Z] -exclude:"/home/jenkins/workspace/Test_openjdk11_hs_extended.openjdk_arm_linux_testList_2/aqa-tests/TKG/../../jvmtest/openjdk/excludes/ProblemList_openjdk11.txt" \
[2024-11-14T04:55:43.954Z] \
[2024-11-14T04:55:43.954Z] -exclude:"/home/jenkins/workspace/Test_openjdk11_hs_extended.openjdk_arm_linux_testList_2/aqa-tests/TKG/../openjdk/excludes/vendors/eclipse/ProblemList_openjdk11.txt" \
[2024-11-14T04:55:43.954Z] "/home/jenkins/workspace/Test_openjdk11_hs_extended.openjdk_arm_linux_testList_2/aqa-tests/TKG/../openjdk/openjdk-jdk/test/jdk:jdk_jmx"; \
[2024-11-14T04:55:43.954Z] if [ $? -eq 0 ]; then echo "-----------------------------------"; echo "jdk_jmx_2""_PASSED"; echo "-----------------------------------"; cd /home/jenkins/workspace/Test_openjdk11_hs_extended.openjdk_arm_linux_testList_2/aqa-tests/TKG/..; else echo "-----------------------------------"; echo "jdk_jmx_2""_FAILED"; echo "-----------------------------------"; fi; \
[2024-11-14T04:55:43.954Z] echo ""; echo "TEST TEARDOWN:"; \
[2024-11-14T04:55:43.954Z] echo "Nothing to be done for teardown."; \
[2024-11-14T04:55:43.954Z] } 2>&1 | tee -a "/home/jenkins/workspace/Test_openjdk11_hs_extended.openjdk_arm_linux_testList_2/aqa-tests/TKG/../TKG/output_17315397621362/TestTargetResult";
[2024-11-14T04:55:43.954Z]
[2024-11-14T04:55:43.954Z] TEST SETUP:
[2024-11-14T04:55:43.954Z] Nothing to be done for setup.
[2024-11-14T04:55:43.954Z]
[2024-11-14T04:55:43.954Z] TESTING:
[2024-11-14T04:55:44.728Z] Directory "/home/jenkins/workspace/Test_openjdk11_hs_extended.openjdk_arm_linux_testList_2/aqa-tests/TKG/../TKG/output_17315397621362/jdk_jmx_2/work" not found: creating
[2024-11-14T04:55:44.728Z] Directory "/home/jenkins/workspace/Test_openjdk11_hs_extended.openjdk_arm_linux_testList_2/aqa-tests/TKG/../TKG/output_17315397621362/jdk_jmx_2/report" not found: creating
[2024-11-14T04:55:48.690Z] XML output with verification to /home/jenkins/workspace/Test_openjdk11_hs_extended.openjdk_arm_linux_testList_2/aqa-tests/TKG/output_17315397621362/jdk_jmx_2/work
[2024-11-14T04:58:53.586Z] --------------------------------------------------
[2024-11-14T04:58:53.586Z] TEST: javax/management/monitor/DerivedGaugeMonitorTest.java
[2024-11-14T04:58:53.586Z] TEST JDK: /home/jenkins/workspace/Test_openjdk11_hs_extended.openjdk_arm_linux_testList_2/jdkbinary/j2sdk-image
[2024-11-14T04:58:53.586Z]
[2024-11-14T04:58:53.586Z] ACTION: clean -- Passed. Clean successful
[2024-11-14T04:58:53.586Z] REASON: User specified action: run clean DerivedGaugeMonitorTest
[2024-11-14T04:58:53.586Z] TIME: 0.001 seconds
[2024-11-14T04:58:53.586Z] messages:
[2024-11-14T04:58:53.586Z] command: clean DerivedGaugeMonitorTest
[2024-11-14T04:58:53.586Z] reason: User specified action: run clean DerivedGaugeMonitorTest
[2024-11-14T04:58:53.586Z] started: Thu Nov 14 04:57:16 UTC 2024
[2024-11-14T04:58:53.586Z] finished: Thu Nov 14 04:57:16 UTC 2024
[2024-11-14T04:58:53.586Z] elapsed time (seconds): 0.001
[2024-11-14T04:58:53.586Z] rerun:
[2024-11-14T04:58:53.586Z] cd /home/jenkins/workspace/Test_openjdk11_hs_extended.openjdk_arm_linux_testList_2/aqa-tests/TKG/output_17315397621362/jdk_jmx_2/work/javax/management/monitor/DerivedGaugeMonitorTest && \
[2024-11-14T04:58:53.586Z] rm -f /home/jenkins/workspace/Test_openjdk11_hs_extended.openjdk_arm_linux_testList_2/aqa-tests/TKG/output_17315397621362/jdk_jmx_2/work/classes/11/javax/management/monitor/DerivedGaugeMonitorTest.d/DerivedGaugeMonitorTest.class
[2024-11-14T04:58:53.586Z]
[2024-11-14T04:58:53.586Z] ACTION: build -- Passed. Build successful
[2024-11-14T04:58:53.586Z] REASON: User specified action: run build DerivedGaugeMonitorTest
[2024-11-14T04:58:53.586Z] TIME: 63.198 seconds
[2024-11-14T04:58:53.586Z] messages:
[2024-11-14T04:58:53.586Z] command: build DerivedGaugeMonitorTest
[2024-11-14T04:58:53.586Z] reason: User specified action: run build DerivedGaugeMonitorTest
[2024-11-14T04:58:53.586Z] started: Thu Nov 14 04:57:16 UTC 2024
[2024-11-14T04:58:53.586Z] Test directory:
[2024-11-14T04:58:53.586Z] compile: DerivedGaugeMonitorTest
[2024-11-14T04:58:53.586Z] finished: Thu Nov 14 04:58:19 UTC 2024
[2024-11-14T04:58:53.586Z] elapsed time (seconds): 63.198
[2024-11-14T04:58:53.586Z]
[2024-11-14T04:58:53.586Z] ACTION: compile -- Passed. Compilation successful
[2024-11-14T04:58:53.586Z] REASON: .class file out of date or does not exist
[2024-11-14T04:58:53.586Z] TIME: 63.103 seconds
[2024-11-14T04:58:53.586Z] messages:
[2024-11-14T04:58:53.586Z] command: compile /home/jenkins/workspace/Test_openjdk11_hs_extended.openjdk_arm_linux_testList_2/aqa-tests/openjdk/openjdk-jdk/test/jdk/javax/management/monitor/DerivedGaugeMonitorTest.java
[2024-11-14T04:58:53.586Z] reason: .class file out of date or does not exist
[2024-11-14T04:58:53.586Z] started: Thu Nov 14 04:57:16 UTC 2024
[2024-11-14T04:58:53.586Z] Additional options from @modules: --add-modules java.management
[2024-11-14T04:58:53.586Z] Mode: othervm
[2024-11-14T04:58:53.586Z] finished: Thu Nov 14 04:58:19 UTC 2024
[2024-11-14T04:58:53.586Z] elapsed time (seconds): 63.103
[2024-11-14T04:58:53.586Z] configuration:
[2024-11-14T04:58:53.586Z] javac compilation environment
[2024-11-14T04:58:53.586Z] add modules: java.management
[2024-11-14T04:58:53.586Z] source path: /home/jenkins/workspace/Test_openjdk11_hs_extended.openjdk_arm_linux_testList_2/aqa-tests/openjdk/openjdk-jdk/test/jdk/javax/management/monitor
[2024-11-14T04:58:53.586Z] class path: /home/jenkins/workspace/Test_openjdk11_hs_extended.openjdk_arm_linux_testList_2/aqa-tests/openjdk/openjdk-jdk/test/jdk/javax/management/monitor
[2024-11-14T04:58:53.586Z] /home/jenkins/workspace/Test_openjdk11_hs_extended.openjdk_arm_linux_testList_2/aqa-tests/TKG/output_17315397621362/jdk_jmx_2/work/classes/11/javax/management/monitor/DerivedGaugeMonitorTest.d
[2024-11-14T04:58:53.586Z]
[2024-11-14T04:58:53.586Z] rerun:
[2024-11-14T04:58:53.586Z] cd /home/jenkins/workspace/Test_openjdk11_hs_extended.openjdk_arm_linux_testList_2/aqa-tests/TKG/output_17315397621362/jdk_jmx_2/work/javax/management/monitor/DerivedGaugeMonitorTest && \
[2024-11-14T04:58:53.586Z] DISPLAY=:0 \
[2024-11-14T04:58:53.586Z] HOME=/home/jenkins \
[2024-11-14T04:58:53.586Z] PATH=/bin:/usr/bin:/usr/sbin \
[2024-11-14T04:58:53.586Z] /home/jenkins/workspace/Test_openjdk11_hs_extended.openjdk_arm_linux_testList_2/jdkbinary/j2sdk-image/bin/javac \
[2024-11-14T04:58:53.586Z] -J-ea \
[2024-11-14T04:58:53.586Z] -J-esa \
[2024-11-14T04:58:53.586Z] -J-Xmx512m \
[2024-11-14T04:58:53.586Z] -J-Dtest.vm.opts='-ea -esa -Xmx512m' \
[2024-11-14T04:58:53.586Z] -J-Dtest.tool.vm.opts='-J-ea -J-esa -J-Xmx512m' \
[2024-11-14T04:58:53.586Z] -J-Dtest.compiler.opts= \
[2024-11-14T04:58:53.586Z] -J-Dtest.java.opts= \
[2024-11-14T04:58:53.586Z] -J-Dtest.jdk=/home/jenkins/workspace/Test_openjdk11_hs_extended.openjdk_arm_linux_testList_2/jdkbinary/j2sdk-image \
[2024-11-14T04:58:53.586Z] -J-Dcompile.jdk=/home/jenkins/workspace/Test_openjdk11_hs_extended.openjdk_arm_linux_testList_2/jdkbinary/j2sdk-image \
[2024-11-14T04:58:53.586Z] -J-Dtest.timeout.factor=8.0 \
[2024-11-14T04:58:53.586Z] -J-Dtest.nativepath=/home/jenkins/workspace/Test_openjdk11_hs_extended.openjdk_arm_linux_testList_2/jdkbinary/openjdk-test-image/jdk/jtreg/native \
[2024-11-14T04:58:53.586Z] -J-Dtest.root=/home/jenkins/workspace/Test_openjdk11_hs_extended.openjdk_arm_linux_testList_2/aqa-tests/openjdk/openjdk-jdk/test/jdk \
[2024-11-14T04:58:53.586Z] -J-Dtest.name=javax/management/monitor/DerivedGaugeMonitorTest.java \
[2024-11-14T04:58:53.586Z] -J-Dtest.file=/home/jenkins/workspace/Test_openjdk11_hs_extended.openjdk_arm_linux_testList_2/aqa-tests/openjdk/openjdk-jdk/test/jdk/javax/management/monitor/DerivedGaugeMonitorTest.java \
[2024-11-14T04:58:53.586Z] -J-Dtest.src=/home/jenkins/workspace/Test_openjdk11_hs_extended.openjdk_arm_linux_testList_2/aqa-tests/openjdk/openjdk-jdk/test/jdk/javax/management/monitor \
[2024-11-14T04:58:53.586Z] -J-Dtest.src.path=/home/jenkins/workspace/Test_openjdk11_hs_extended.openjdk_arm_linux_testList_2/aqa-tests/openjdk/openjdk-jdk/test/jdk/javax/management/monitor \
[2024-11-14T04:58:53.586Z] -J-Dtest.classes=/home/jenkins/workspace/Test_openjdk11_hs_extended.openjdk_arm_linux_testList_2/aqa-tests/TKG/output_17315397621362/jdk_jmx_2/work/classes/11/javax/management/monitor/DerivedGaugeMonitorTest.d \
[2024-11-14T04:58:53.586Z] -J-Dtest.class.path=/home/jenkins/workspace/Test_openjdk11_hs_extended.openjdk_arm_linux_testList_2/aqa-tests/TKG/output_17315397621362/jdk_jmx_2/work/classes/11/javax/management/monitor/DerivedGaugeMonitorTest.d \
[2024-11-14T04:58:53.586Z] -J-Dtest.modules=java.management \
[2024-11-14T04:58:53.586Z] --add-modules java.management \
[2024-11-14T04:58:53.586Z] -d /home/jenkins/workspace/Test_openjdk11_hs_extended.openjdk_arm_linux_testList_2/aqa-tests/TKG/output_17315397621362/jdk_jmx_2/work/classes/11/javax/management/monitor/DerivedGaugeMonitorTest.d \
[2024-11-14T04:58:53.586Z] -sourcepath /home/jenkins/workspace/Test_openjdk11_hs_extended.openjdk_arm_linux_testList_2/aqa-tests/openjdk/openjdk-jdk/test/jdk/javax/management/monitor \
[2024-11-14T04:58:53.587Z] -classpath /home/jenkins/workspace/Test_openjdk11_hs_extended.openjdk_arm_linux_testList_2/aqa-tests/openjdk/openjdk-jdk/test/jdk/javax/management/monitor:/home/jenkins/workspace/Test_openjdk11_hs_extended.openjdk_arm_linux_testList_2/aqa-tests/TKG/output_17315397621362/jdk_jmx_2/work/classes/11/javax/management/monitor/DerivedGaugeMonitorTest.d /home/jenkins/workspace/Test_openjdk11_hs_extended.openjdk_arm_linux_testList_2/aqa-tests/openjdk/openjdk-jdk/test/jdk/javax/management/monitor/DerivedGaugeMonitorTest.java
[2024-11-14T04:58:53.587Z] STDOUT:
[2024-11-14T04:58:53.587Z] STDERR:
[2024-11-14T04:58:53.587Z]
[2024-11-14T04:58:53.587Z] ACTION: build -- Passed. All files up to date
[2024-11-14T04:58:53.587Z] REASON: Named class compiled on demand
[2024-11-14T04:58:53.587Z] TIME: 0.0 seconds
[2024-11-14T04:58:53.587Z] messages:
[2024-11-14T04:58:53.587Z] command: build DerivedGaugeMonitorTest
[2024-11-14T04:58:53.587Z] reason: Named class compiled on demand
[2024-11-14T04:58:53.587Z] started: Thu Nov 14 04:58:19 UTC 2024
[2024-11-14T04:58:53.587Z] finished: Thu Nov 14 04:58:19 UTC 2024
[2024-11-14T04:58:53.587Z] elapsed time (seconds): 0.0
[2024-11-14T04:58:53.587Z]
[2024-11-14T04:58:53.587Z] ACTION: main -- Failed. Execution failed: `main' threw exception: java.lang.Exception: AByte: Count down not reached!
[2024-11-14T04:58:53.587Z] REASON: User specified action: run main DerivedGaugeMonitorTest
[2024-11-14T04:58:53.587Z] TIME: 20.303 seconds
[2024-11-14T04:58:53.587Z] messages:
[2024-11-14T04:58:53.587Z] command: main DerivedGaugeMonitorTest
[2024-11-14T04:58:53.587Z] reason: User specified action: run main DerivedGaugeMonitorTest
[2024-11-14T04:58:53.587Z] started: Thu Nov 14 04:58:19 UTC 2024
[2024-11-14T04:58:53.587Z] Mode: othervm
[2024-11-14T04:58:53.587Z] Additional options from @modules: --add-modules java.management
[2024-11-14T04:58:53.587Z] finished: Thu Nov 14 04:58:39 UTC 2024
[2024-11-14T04:58:53.587Z] elapsed time (seconds): 20.303
[2024-11-14T04:58:53.587Z] configuration:
[2024-11-14T04:58:53.587Z] Boot Layer
[2024-11-14T04:58:53.587Z] add modules: java.management
[2024-11-14T04:58:53.587Z]
[2024-11-14T04:58:53.587Z] STDOUT:
[2024-11-14T04:58:53.587Z] STDERR:
[2024-11-14T04:58:53.587Z] Testing AByte
[2024-11-14T04:58:53.587Z] java.lang.Exception: AByte: Count down not reached!
[2024-11-14T04:58:53.587Z] at DerivedGaugeMonitorTest.test(DerivedGaugeMonitorTest.java:244)
[2024-11-14T04:58:53.587Z] at DerivedGaugeMonitorTest.main(DerivedGaugeMonitorTest.java:264)
[2024-11-14T04:58:53.587Z] at java.base/jdk.internal.reflect.NativeMethodAccessorImpl.invoke0(Native Method)
[2024-11-14T04:58:53.587Z] at java.base/jdk.internal.reflect.NativeMethodAccessorImpl.invoke(NativeMethodAccessorImpl.java:62)
[2024-11-14T04:58:53.587Z] at java.base/jdk.internal.reflect.DelegatingMethodAccessorImpl.invoke(DelegatingMethodAccessorImpl.java:43)
[2024-11-14T04:58:53.587Z] at java.base/java.lang.reflect.Method.invoke(Method.java:566)
[2024-11-14T04:58:53.587Z] at com.sun.javatest.regtest.agent.MainWrapper$MainTask.run(MainWrapper.java:138)
[2024-11-14T04:58:53.587Z] at java.base/java.lang.Thread.run(Thread.java:829)
[2024-11-14T04:58:53.587Z]
[2024-11-14T04:58:53.587Z] JavaTest Message: Test threw exception: java.lang.Exception: AByte: Count down not reached!
[2024-11-14T04:58:53.587Z] JavaTest Message: shutting down test
[2024-11-14T04:58:53.587Z]
[2024-11-14T04:58:53.587Z] STATUS:Failed.`main' threw exception: java.lang.Exception: AByte: Count down not reached!
[2024-11-14T04:58:53.587Z] rerun:
[2024-11-14T04:58:53.587Z] cd /home/jenkins/workspace/Test_openjdk11_hs_extended.openjdk_arm_linux_testList_2/aqa-tests/TKG/output_17315397621362/jdk_jmx_2/work/javax/management/monitor/DerivedGaugeMonitorTest && \
[2024-11-14T04:58:53.587Z] DISPLAY=:0 \
[2024-11-14T04:58:53.587Z] HOME=/home/jenkins \
[2024-11-14T04:58:53.587Z] PATH=/bin:/usr/bin:/usr/sbin \
[2024-11-14T04:58:53.587Z] CLASSPATH=/home/jenkins/workspace/Test_openjdk11_hs_extended.openjdk_arm_linux_testList_2/aqa-tests/TKG/output_17315397621362/jdk_jmx_2/work/classes/11/javax/management/monitor/DerivedGaugeMonitorTest.d:/home/jenkins/workspace/Test_openjdk11_hs_extended.openjdk_arm_linux_testList_2/aqa-tests/openjdk/openjdk-jdk/test/jdk/javax/management/monitor:/home/jenkins/workspace/Test_openjdk11_hs_extended.openjdk_arm_linux_testList_2/jvmtest/openjdk/jtreg/lib/javatest.jar:/home/jenkins/workspace/Test_openjdk11_hs_extended.openjdk_arm_linux_testList_2/jvmtest/openjdk/jtreg/lib/jtreg.jar \
[2024-11-14T04:58:53.587Z] /home/jenkins/workspace/Test_openjdk11_hs_extended.openjdk_arm_linux_testList_2/jdkbinary/j2sdk-image/bin/java \
[2024-11-14T04:58:53.587Z] -Dtest.vm.opts='-ea -esa -Xmx512m' \
[2024-11-14T04:58:53.587Z] -Dtest.tool.vm.opts='-J-ea -J-esa -J-Xmx512m' \
[2024-11-14T04:58:53.587Z] -Dtest.compiler.opts= \
[2024-11-14T04:58:53.587Z] -Dtest.java.opts= \
[2024-11-14T04:58:53.587Z] -Dtest.jdk=/home/jenkins/workspace/Test_openjdk11_hs_extended.openjdk_arm_linux_testList_2/jdkbinary/j2sdk-image \
[2024-11-14T04:58:53.587Z] -Dcompile.jdk=/home/jenkins/workspace/Test_openjdk11_hs_extended.openjdk_arm_linux_testList_2/jdkbinary/j2sdk-image \
[2024-11-14T04:58:53.587Z] -Dtest.timeout.factor=8.0 \
[2024-11-14T04:58:53.587Z] -Dtest.nativepath=/home/jenkins/workspace/Test_openjdk11_hs_extended.openjdk_arm_linux_testList_2/jdkbinary/openjdk-test-image/jdk/jtreg/native \
[2024-11-14T04:58:53.587Z] -Dtest.root=/home/jenkins/workspace/Test_openjdk11_hs_extended.openjdk_arm_linux_testList_2/aqa-tests/openjdk/openjdk-jdk/test/jdk \
[2024-11-14T04:58:53.587Z] -Dtest.name=javax/management/monitor/DerivedGaugeMonitorTest.java \
[2024-11-14T04:58:53.587Z] -Dtest.file=/home/jenkins/workspace/Test_openjdk11_hs_extended.openjdk_arm_linux_testList_2/aqa-tests/openjdk/openjdk-jdk/test/jdk/javax/management/monitor/DerivedGaugeMonitorTest.java \
[2024-11-14T04:58:53.587Z] -Dtest.src=/home/jenkins/workspace/Test_openjdk11_hs_extended.openjdk_arm_linux_testList_2/aqa-tests/openjdk/openjdk-jdk/test/jdk/javax/management/monitor \
[2024-11-14T04:58:53.587Z] -Dtest.src.path=/home/jenkins/workspace/Test_openjdk11_hs_extended.openjdk_arm_linux_testList_2/aqa-tests/openjdk/openjdk-jdk/test/jdk/javax/management/monitor \
[2024-11-14T04:58:53.587Z] -Dtest.classes=/home/jenkins/workspace/Test_openjdk11_hs_extended.openjdk_arm_linux_testList_2/aqa-tests/TKG/output_17315397621362/jdk_jmx_2/work/classes/11/javax/management/monitor/DerivedGaugeMonitorTest.d \
[2024-11-14T04:58:53.587Z] -Dtest.class.path=/home/jenkins/workspace/Test_openjdk11_hs_extended.openjdk_arm_linux_testList_2/aqa-tests/TKG/output_17315397621362/jdk_jmx_2/work/classes/11/javax/management/monitor/DerivedGaugeMonitorTest.d \
[2024-11-14T04:58:53.587Z] -Dtest.modules=java.management \
[2024-11-14T04:58:53.587Z] --add-modules java.management \
[2024-11-14T04:58:53.587Z] -ea \
[2024-11-14T04:58:53.587Z] -esa \
[2024-11-14T04:58:53.587Z] -Xmx512m \
[2024-11-14T04:58:53.587Z] -Djava.library.path=/home/jenkins/workspace/Test_openjdk11_hs_extended.openjdk_arm_linux_testList_2/jdkbinary/openjdk-test-image/jdk/jtreg/native \
[2024-11-14T04:58:53.587Z] com.sun.javatest.regtest.agent.MainWrapper /home/jenkins/workspace/Test_openjdk11_hs_extended.openjdk_arm_linux_testList_2/aqa-tests/TKG/output_17315397621362/jdk_jmx_2/work/javax/management/monitor/DerivedGaugeMonitorTest.d/main.0.jta
[2024-11-14T04:58:53.587Z]
[2024-11-14T04:58:53.587Z] TEST RESULT: Failed. Execution failed: `main' threw exception: java.lang.Exception: AByte: Count down not reached!
[2024-11-14T04:58:53.587Z] --------------------------------------------------
[2024-11-14T04:59:59.611Z] TEST: javax/management/monitor/StartStopTest.java
[2024-11-14T04:59:59.611Z] TEST JDK: /home/jenkins/workspace/Test_openjdk11_hs_extended.openjdk_arm_linux_testList_2/jdkbinary/j2sdk-image
[2024-11-14T04:59:59.611Z]
[2024-11-14T04:59:59.611Z] ACTION: clean -- Passed. Clean successful
[2024-11-14T04:59:59.611Z] REASON: User specified action: run clean StartStopTest
[2024-11-14T04:59:59.611Z] TIME: 0.001 seconds
[2024-11-14T04:59:59.611Z] messages:
[2024-11-14T04:59:59.611Z] command: clean StartStopTest
[2024-11-14T04:59:59.611Z] reason: User specified action: run clean StartStopTest
[2024-11-14T04:59:59.611Z] started: Thu Nov 14 04:57:18 UTC 2024
[2024-11-14T04:59:59.611Z] finished: Thu Nov 14 04:57:18 UTC 2024
[2024-11-14T04:59:59.611Z] elapsed time (seconds): 0.001
[2024-11-14T04:59:59.611Z] rerun:
[2024-11-14T04:59:59.611Z] cd /home/jenkins/workspace/Test_openjdk11_hs_extended.openjdk_arm_linux_testList_2/aqa-tests/TKG/output_17315397621362/jdk_jmx_2/work/javax/management/monitor/StartStopTest && \
[2024-11-14T04:59:59.611Z] rm -f /home/jenkins/workspace/Test_openjdk11_hs_extended.openjdk_arm_linux_testList_2/aqa-tests/TKG/output_17315397621362/jdk_jmx_2/work/classes/9/javax/management/monitor/StartStopTest.d/StartStopTest.class
[2024-11-14T04:59:59.611Z]
[2024-11-14T04:59:59.611Z] ACTION: build -- Passed. Build successful
[2024-11-14T04:59:59.611Z] REASON: User specified action: run build StartStopTest
[2024-11-14T04:59:59.611Z] TIME: 127.594 seconds
[2024-11-14T04:59:59.611Z] messages:
[2024-11-14T04:59:59.611Z] command: build StartStopTest
[2024-11-14T04:59:59.611Z] reason: User specified action: run build StartStopTest
[2024-11-14T04:59:59.611Z] started: Thu Nov 14 04:57:18 UTC 2024
[2024-11-14T04:59:59.611Z] Test directory:
[2024-11-14T04:59:59.611Z] compile: StartStopTest
[2024-11-14T04:59:59.611Z] finished: Thu Nov 14 04:59:26 UTC 2024
[2024-11-14T04:59:59.611Z] elapsed time (seconds): 127.594
[2024-11-14T04:59:59.611Z]
[2024-11-14T04:59:59.611Z] ACTION: compile -- Passed. Compilation successful
[2024-11-14T04:59:59.611Z] REASON: .class file out of date or does not exist
[2024-11-14T04:59:59.611Z] TIME: 126.899 seconds
[2024-11-14T04:59:59.611Z] messages:
[2024-11-14T04:59:59.611Z] command: compile /home/jenkins/workspace/Test_openjdk11_hs_extended.openjdk_arm_linux_testList_2/aqa-tests/openjdk/openjdk-jdk/test/jdk/javax/management/monitor/StartStopTest.java
[2024-11-14T04:59:59.611Z] reason: .class file out of date or does not exist
[2024-11-14T04:59:59.611Z] started: Thu Nov 14 04:57:19 UTC 2024
[2024-11-14T04:59:59.611Z] Additional options from @modules: --add-modules java.management
[2024-11-14T04:59:59.611Z] Mode: othervm
[2024-11-14T04:59:59.611Z] finished: Thu Nov 14 04:59:26 UTC 2024
[2024-11-14T04:59:59.611Z] elapsed time (seconds): 126.899
[2024-11-14T04:59:59.611Z] configuration:
[2024-11-14T04:59:59.611Z] javac compilation environment
[2024-11-14T04:59:59.611Z] add modules: java.management
[2024-11-14T04:59:59.611Z] source path: /home/jenkins/workspace/Test_openjdk11_hs_extended.openjdk_arm_linux_testList_2/aqa-tests/openjdk/openjdk-jdk/test/jdk/javax/management/monitor
[2024-11-14T04:59:59.611Z] /home/jenkins/workspace/Test_openjdk11_hs_extended.openjdk_arm_linux_testList_2/aqa-tests/openjdk/openjdk-jdk/test/lib
[2024-11-14T04:59:59.611Z] class path: /home/jenkins/workspace/Test_openjdk11_hs_extended.openjdk_arm_linux_testList_2/aqa-tests/openjdk/openjdk-jdk/test/jdk/javax/management/monitor
[2024-11-14T04:59:59.611Z] /home/jenkins/workspace/Test_openjdk11_hs_extended.openjdk_arm_linux_testList_2/aqa-tests/TKG/output_17315397621362/jdk_jmx_2/work/classes/9/javax/management/monitor/StartStopTest.d
[2024-11-14T04:59:59.611Z] /home/jenkins/workspace/Test_openjdk11_hs_extended.openjdk_arm_linux_testList_2/aqa-tests/TKG/output_17315397621362/jdk_jmx_2/work/classes/9/test/lib
[2024-11-14T04:59:59.611Z]
[2024-11-14T04:59:59.611Z] rerun:
[2024-11-14T04:59:59.611Z] cd /home/jenkins/workspace/Test_openjdk11_hs_extended.openjdk_arm_linux_testList_2/aqa-tests/TKG/output_17315397621362/jdk_jmx_2/work/javax/management/monitor/StartStopTest && \
[2024-11-14T04:59:59.611Z] DISPLAY=:0 \
[2024-11-14T04:59:59.611Z] HOME=/home/jenkins \
[2024-11-14T04:59:59.611Z] PATH=/bin:/usr/bin:/usr/sbin \
[2024-11-14T04:59:59.611Z] /home/jenkins/workspace/Test_openjdk11_hs_extended.openjdk_arm_linux_testList_2/jdkbinary/j2sdk-image/bin/javac \
[2024-11-14T04:59:59.611Z] -J-ea \
[2024-11-14T04:59:59.611Z] -J-esa \
[2024-11-14T04:59:59.611Z] -J-Xmx512m \
[2024-11-14T04:59:59.611Z] -J-Dtest.vm.opts='-ea -esa -Xmx512m' \
[2024-11-14T04:59:59.611Z] -J-Dtest.tool.vm.opts='-J-ea -J-esa -J-Xmx512m' \
[2024-11-14T04:59:59.611Z] -J-Dtest.compiler.opts= \
[2024-11-14T04:59:59.611Z] -J-Dtest.java.opts= \
[2024-11-14T04:59:59.611Z] -J-Dtest.jdk=/home/jenkins/workspace/Test_openjdk11_hs_extended.openjdk_arm_linux_testList_2/jdkbinary/j2sdk-image \
[2024-11-14T04:59:59.611Z] -J-Dcompile.jdk=/home/jenkins/workspace/Test_openjdk11_hs_extended.openjdk_arm_linux_testList_2/jdkbinary/j2sdk-image \
[2024-11-14T04:59:59.611Z] -J-Dtest.timeout.factor=8.0 \
[2024-11-14T04:59:59.611Z] -J-Dtest.nativepath=/home/jenkins/workspace/Test_openjdk11_hs_extended.openjdk_arm_linux_testList_2/jdkbinary/openjdk-test-image/jdk/jtreg/native \
[2024-11-14T04:59:59.611Z] -J-Dtest.root=/home/jenkins/workspace/Test_openjdk11_hs_extended.openjdk_arm_linux_testList_2/aqa-tests/openjdk/openjdk-jdk/test/jdk \
[2024-11-14T04:59:59.611Z] -J-Dtest.name=javax/management/monitor/StartStopTest.java \
[2024-11-14T04:59:59.611Z] -J-Dtest.file=/home/jenkins/workspace/Test_openjdk11_hs_extended.openjdk_arm_linux_testList_2/aqa-tests/openjdk/openjdk-jdk/test/jdk/javax/management/monitor/StartStopTest.java \
[2024-11-14T04:59:59.611Z] -J-Dtest.src=/home/jenkins/workspace/Test_openjdk11_hs_extended.openjdk_arm_linux_testList_2/aqa-tests/openjdk/openjdk-jdk/test/jdk/javax/management/monitor \
[2024-11-14T04:59:59.611Z] -J-Dtest.src.path=/home/jenkins/workspace/Test_openjdk11_hs_extended.openjdk_arm_linux_testList_2/aqa-tests/openjdk/openjdk-jdk/test/jdk/javax/management/monitor:/home/jenkins/workspace/Test_openjdk11_hs_extended.openjdk_arm_linux_testList_2/aqa-tests/openjdk/openjdk-jdk/test/lib \
[2024-11-14T04:59:59.611Z] -J-Dtest.classes=/home/jenkins/workspace/Test_openjdk11_hs_extended.openjdk_arm_linux_testList_2/aqa-tests/TKG/output_17315397621362/jdk_jmx_2/work/classes/9/javax/management/monitor/StartStopTest.d \
[2024-11-14T04:59:59.612Z] -J-Dtest.class.path=/home/jenkins/workspace/Test_openjdk11_hs_extended.openjdk_arm_linux_testList_2/aqa-tests/TKG/output_17315397621362/jdk_jmx_2/work/classes/9/javax/management/monitor/StartStopTest.d:/home/jenkins/workspace/Test_openjdk11_hs_extended.openjdk_arm_linux_testList_2/aqa-tests/TKG/output_17315397621362/jdk_jmx_2/work/classes/9/test/lib \
[2024-11-14T04:59:59.612Z] -J-Dtest.modules=java.management \
[2024-11-14T04:59:59.612Z] --add-modules java.management \
[2024-11-14T04:59:59.612Z] -d /home/jenkins/workspace/Test_openjdk11_hs_extended.openjdk_arm_linux_testList_2/aqa-tests/TKG/output_17315397621362/jdk_jmx_2/work/classes/9/javax/management/monitor/StartStopTest.d \
[2024-11-14T04:59:59.612Z] -sourcepath /home/jenkins/workspace/Test_openjdk11_hs_extended.openjdk_arm_linux_testList_2/aqa-tests/openjdk/openjdk-jdk/test/jdk/javax/management/monitor:/home/jenkins/workspace/Test_openjdk11_hs_extended.openjdk_arm_linux_testList_2/aqa-tests/openjdk/openjdk-jdk/test/lib \
[2024-11-14T04:59:59.612Z] -classpath /home/jenkins/workspace/Test_openjdk11_hs_extended.openjdk_arm_linux_testList_2/aqa-tests/openjdk/openjdk-jdk/test/jdk/javax/management/monitor:/home/jenkins/workspace/Test_openjdk11_hs_extended.openjdk_arm_linux_testList_2/aqa-tests/TKG/output_17315397621362/jdk_jmx_2/work/classes/9/javax/management/monitor/StartStopTest.d:/home/jenkins/workspace/Test_openjdk11_hs_extended.openjdk_arm_linux_testList_2/aqa-tests/TKG/output_17315397621362/jdk_jmx_2/work/classes/9/test/lib /home/jenkins/workspace/Test_openjdk11_hs_extended.openjdk_arm_linux_testList_2/aqa-tests/openjdk/openjdk-jdk/test/jdk/javax/management/monitor/StartStopTest.java
[2024-11-14T04:59:59.612Z] STDOUT:
[2024-11-14T04:59:59.612Z] STDERR:
[2024-11-14T04:59:59.612Z]
[2024-11-14T04:59:59.612Z] ACTION: build -- Passed. All files up to date
[2024-11-14T04:59:59.612Z] REASON: Named class compiled on demand
[2024-11-14T04:59:59.612Z] TIME: 0.0 seconds
[2024-11-14T04:59:59.612Z] messages:
[2024-11-14T04:59:59.612Z] command: build StartStopTest
[2024-11-14T04:59:59.612Z] reason: Named class compiled on demand
[2024-11-14T04:59:59.612Z] started: Thu Nov 14 04:59:26 UTC 2024
[2024-11-14T04:59:59.612Z] finished: Thu Nov 14 04:59:26 UTC 2024
[2024-11-14T04:59:59.612Z] elapsed time (seconds): 0.0
[2024-11-14T04:59:59.612Z]
[2024-11-14T04:59:59.612Z] ACTION: main -- Failed. Execution failed: `main' threw exception: java.lang.IllegalStateException: Test FAILED: Unexpected Maximum Pool Size Overflow!
[2024-11-14T04:59:59.612Z] REASON: User specified action: run main/othervm/timeout=300 StartStopTest 1
[2024-11-14T04:59:59.612Z] TIME: 33.0 seconds
[2024-11-14T04:59:59.612Z] messages:
[2024-11-14T04:59:59.612Z] command: main StartStopTest 1
[2024-11-14T04:59:59.612Z] reason: User specified action: run main/othervm/timeout=300 StartStopTest 1
[2024-11-14T04:59:59.612Z] started: Thu Nov 14 04:59:26 UTC 2024
[2024-11-14T04:59:59.612Z] Mode: othervm [/othervm specified]
[2024-11-14T04:59:59.612Z] Additional options from @modules: --add-modules java.management
[2024-11-14T04:59:59.612Z] finished: Thu Nov 14 04:59:59 UTC 2024
[2024-11-14T04:59:59.612Z] elapsed time (seconds): 33.0
[2024-11-14T04:59:59.612Z] configuration:
[2024-11-14T04:59:59.612Z] Boot Layer
[2024-11-14T04:59:59.612Z] add modules: java.management
[2024-11-14T04:59:59.612Z]
[2024-11-14T04:59:59.612Z] STDOUT:
[2024-11-14T04:59:59.612Z] >>> MAXIMUM POOL SIZE = 10 [default value]
[2024-11-14T04:59:59.612Z] >>> CREATE MBeanServer
[2024-11-14T04:59:59.612Z] >>> CREATE ObservedObject = :type=ObservedObject,instance=1
[2024-11-14T04:59:59.612Z] >>> CREATE Monitor = :type=CounterMonitor,instance=1
[2024-11-14T04:59:59.612Z] >>> CREATE ObservedObject = :type=ObservedObject,instance=2
[2024-11-14T04:59:59.612Z] >>> CREATE Monitor = :type=CounterMonitor,instance=2
[2024-11-14T04:59:59.612Z] >>> CREATE ObservedObject = :type=ObservedObject,instance=3
[2024-11-14T04:59:59.612Z] >>> CREATE Monitor = :type=CounterMonitor,instance=3
[2024-11-14T04:59:59.612Z] >>> CREATE ObservedObject = :type=ObservedObject,instance=4
[2024-11-14T04:59:59.612Z] >>> CREATE Monitor = :type=CounterMonitor,instance=4
[2024-11-14T04:59:59.612Z] >>> CREATE ObservedObject = :type=ObservedObject,instance=5
[2024-11-14T04:59:59.612Z] >>> CREATE Monitor = :type=CounterMonitor,instance=5
[2024-11-14T04:59:59.612Z] >>> CREATE ObservedObject = :type=ObservedObject,instance=6
[2024-11-14T04:59:59.612Z] >>> CREATE Monitor = :type=CounterMonitor,instance=6
[2024-11-14T04:59:59.612Z] >>> CREATE ObservedObject = :type=ObservedObject,instance=7
[2024-11-14T04:59:59.612Z] >>> CREATE Monitor = :type=CounterMonitor,instance=7
[2024-11-14T04:59:59.612Z] >>> CREATE ObservedObject = :type=ObservedObject,instance=8
[2024-11-14T04:59:59.612Z] >>> CREATE Monitor = :type=CounterMonitor,instance=8
[2024-11-14T04:59:59.612Z] >>> CREATE ObservedObject = :type=ObservedObject,instance=9
[2024-11-14T04:59:59.612Z] >>> CREATE Monitor = :type=CounterMonitor,instance=9
[2024-11-14T04:59:59.612Z] >>> CREATE ObservedObject = :type=ObservedObject,instance=10
[2024-11-14T04:59:59.612Z] >>> CREATE Monitor = :type=CounterMonitor,instance=10
[2024-11-14T04:59:59.612Z] >>> CREATE ObservedObject = :type=ObservedObject,instance=11
[2024-11-14T04:59:59.612Z] >>> CREATE Monitor = :type=CounterMonitor,instance=11
[2024-11-14T04:59:59.612Z] >>> CREATE ObservedObject = :type=ObservedObject,instance=12
[2024-11-14T04:59:59.612Z] >>> CREATE Monitor = :type=CounterMonitor,instance=12
[2024-11-14T04:59:59.612Z] >>> Start MONITORS
[2024-11-14T04:59:59.612Z] >>> MONITORS started
[2024-11-14T04:59:59.612Z] >>> Check FLAGS true
[2024-11-14T04:59:59.612Z] KO: At least one attribute was not called
[2024-11-14T04:59:59.612Z] >>> Unhappy Bye, Bye!
[2024-11-14T04:59:59.612Z] TASK [5] in getInteger
[2024-11-14T04:59:59.612Z] TASK [4] in getInteger
[2024-11-14T04:59:59.612Z] TASK [3] in getInteger
[2024-11-14T04:59:59.612Z] TASK [2] in getInteger
[2024-11-14T04:59:59.612Z] TASK [7] in getInteger
[2024-11-14T04:59:59.612Z] TASK [10] in getInteger
[2024-11-14T04:59:59.612Z] TASK [1] in getInteger
[2024-11-14T04:59:59.612Z] TASK [8] in getInteger
[2024-11-14T04:59:59.612Z] TASK [9] in getInteger
[2024-11-14T04:59:59.612Z] TASK [6] in getInteger
[2024-11-14T04:59:59.612Z] STDERR:
[2024-11-14T04:59:59.612Z] java.lang.IllegalStateException: Test FAILED: Unexpected Maximum Pool Size Overflow!
[2024-11-14T04:59:59.612Z] at StartStopTest.main(StartStopTest.java:209)
[2024-11-14T04:59:59.612Z] at java.base/jdk.internal.reflect.NativeMethodAccessorImpl.invoke0(Native Method)
[2024-11-14T04:59:59.612Z] at java.base/jdk.internal.reflect.NativeMethodAccessorImpl.invoke(NativeMethodAccessorImpl.java:62)
[2024-11-14T04:59:59.612Z] at java.base/jdk.internal.reflect.DelegatingMethodAccessorImpl.invoke(DelegatingMethodAccessorImpl.java:43)
[2024-11-14T04:59:59.612Z] at java.base/java.lang.reflect.Method.invoke(Method.java:566)
[2024-11-14T04:59:59.612Z] at com.sun.javatest.regtest.agent.MainWrapper$MainTask.run(MainWrapper.java:138)
[2024-11-14T04:59:59.612Z] at java.base/java.lang.Thread.run(Thread.java:829)
[2024-11-14T04:59:59.612Z]
[2024-11-14T04:59:59.612Z] JavaTest Message: Test threw exception: java.lang.IllegalStateException: Test FAILED: Unexpected Maximum Pool Size Overflow!
[2024-11-14T04:59:59.612Z] JavaTest Message: shutting down test
[2024-11-14T04:59:59.612Z]
[2024-11-14T04:59:59.612Z] STATUS:Failed.`main' threw exception: java.lang.IllegalStateException: Test FAILED: Unexpected Maximum Pool Size Overflow!
[2024-11-14T04:59:59.612Z] rerun:
[2024-11-14T04:59:59.612Z] cd /home/jenkins/workspace/Test_openjdk11_hs_extended.openjdk_arm_linux_testList_2/aqa-tests/TKG/output_17315397621362/jdk_jmx_2/work/javax/management/monitor/StartStopTest && \
[2024-11-14T04:59:59.612Z] DISPLAY=:0 \
[2024-11-14T04:59:59.612Z] HOME=/home/jenkins \
[2024-11-14T04:59:59.612Z] PATH=/bin:/usr/bin:/usr/sbin \
[2024-11-14T04:59:59.612Z] CLASSPATH=/home/jenkins/workspace/Test_openjdk11_hs_extended.openjdk_arm_linux_testList_2/aqa-tests/TKG/output_17315397621362/jdk_jmx_2/work/classes/9/javax/management/monitor/StartStopTest.d:/home/jenkins/workspace/Test_openjdk11_hs_extended.openjdk_arm_linux_testList_2/aqa-tests/openjdk/openjdk-jdk/test/jdk/javax/management/monitor:/home/jenkins/workspace/Test_openjdk11_hs_extended.openjdk_arm_linux_testList_2/aqa-tests/TKG/output_17315397621362/jdk_jmx_2/work/classes/9/test/lib:/home/jenkins/workspace/Test_openjdk11_hs_extended.openjdk_arm_linux_testList_2/aqa-tests/openjdk/openjdk-jdk/test/lib:/home/jenkins/workspace/Test_openjdk11_hs_extended.openjdk_arm_linux_testList_2/jvmtest/openjdk/jtreg/lib/javatest.jar:/home/jenkins/workspace/Test_openjdk11_hs_extended.openjdk_arm_linux_testList_2/jvmtest/openjdk/jtreg/lib/jtreg.jar \
[2024-11-14T04:59:59.612Z] /home/jenkins/workspace/Test_openjdk11_hs_extended.openjdk_arm_linux_testList_2/jdkbinary/j2sdk-image/bin/java \
[2024-11-14T04:59:59.612Z] -Dtest.vm.opts='-ea -esa -Xmx512m' \
[2024-11-14T04:59:59.612Z] -Dtest.tool.vm.opts='-J-ea -J-esa -J-Xmx512m' \
[2024-11-14T04:59:59.612Z] -Dtest.compiler.opts= \
[2024-11-14T04:59:59.612Z] -Dtest.java.opts= \
[2024-11-14T04:59:59.612Z] -Dtest.jdk=/home/jenkins/workspace/Test_openjdk11_hs_extended.openjdk_arm_linux_testList_2/jdkbinary/j2sdk-image \
[2024-11-14T04:59:59.612Z] -Dcompile.jdk=/home/jenkins/workspace/Test_openjdk11_hs_extended.openjdk_arm_linux_testList_2/jdkbinary/j2sdk-image \
[2024-11-14T04:59:59.612Z] -Dtest.timeout.factor=8.0 \
[2024-11-14T04:59:59.612Z] -Dtest.nativepath=/home/jenkins/workspace/Test_openjdk11_hs_extended.openjdk_arm_linux_testList_2/jdkbinary/openjdk-test-image/jdk/jtreg/native \
[2024-11-14T04:59:59.612Z] -Dtest.root=/home/jenkins/workspace/Test_openjdk11_hs_extended.openjdk_arm_linux_testList_2/aqa-tests/openjdk/openjdk-jdk/test/jdk \
[2024-11-14T04:59:59.612Z] -Dtest.name=javax/management/monitor/StartStopTest.java \
[2024-11-14T04:59:59.612Z] -Dtest.file=/home/jenkins/workspace/Test_openjdk11_hs_extended.openjdk_arm_linux_testList_2/aqa-tests/openjdk/openjdk-jdk/test/jdk/javax/management/monitor/StartStopTest.java \
[2024-11-14T04:59:59.612Z] -Dtest.src=/home/jenkins/workspace/Test_openjdk11_hs_extended.openjdk_arm_linux_testList_2/aqa-tests/openjdk/openjdk-jdk/test/jdk/javax/management/monitor \
[2024-11-14T04:59:59.612Z] -Dtest.src.path=/home/jenkins/workspace/Test_openjdk11_hs_extended.openjdk_arm_linux_testList_2/aqa-tests/openjdk/openjdk-jdk/test/jdk/javax/management/monitor:/home/jenkins/workspace/Test_openjdk11_hs_extended.openjdk_arm_linux_testList_2/aqa-tests/openjdk/openjdk-jdk/test/lib \
[2024-11-14T04:59:59.612Z] -Dtest.classes=/home/jenkins/workspace/Test_openjdk11_hs_extended.openjdk_arm_linux_testList_2/aqa-tests/TKG/output_17315397621362/jdk_jmx_2/work/classes/9/javax/management/monitor/StartStopTest.d \
[2024-11-14T04:59:59.612Z] -Dtest.class.path=/home/jenkins/workspace/Test_openjdk11_hs_extended.openjdk_arm_linux_testList_2/aqa-tests/TKG/output_17315397621362/jdk_jmx_2/work/classes/9/javax/management/monitor/StartStopTest.d:/home/jenkins/workspace/Test_openjdk11_hs_extended.openjdk_arm_linux_testList_2/aqa-tests/TKG/output_17315397621362/jdk_jmx_2/work/classes/9/test/lib \
[2024-11-14T04:59:59.612Z] -Dtest.modules=java.management \
[2024-11-14T04:59:59.612Z] --add-modules java.management \
[2024-11-14T04:59:59.612Z] -ea \
[2024-11-14T04:59:59.612Z] -esa \
[2024-11-14T04:59:59.612Z] -Xmx512m \
[2024-11-14T04:59:59.612Z] -Djava.library.path=/home/jenkins/workspace/Test_openjdk11_hs_extended.openjdk_arm_linux_testList_2/jdkbinary/openjdk-test-image/jdk/jtreg/native \
[2024-11-14T04:59:59.612Z] com.sun.javatest.regtest.agent.MainWrapper /home/jenkins/workspace/Test_openjdk11_hs_extended.openjdk_arm_linux_testList_2/aqa-tests/TKG/output_17315397621362/jdk_jmx_2/work/javax/management/monitor/StartStopTest.d/main.0.jta 1
[2024-11-14T04:59:59.612Z]
[2024-11-14T04:59:59.612Z] TEST RESULT: Failed. Execution failed: `main' threw exception: java.lang.IllegalStateException: Test FAILED: Unexpected Maximum Pool Size Overflow!
[2024-11-14T04:59:59.612Z] --------------------------------------------------
[2024-11-14T05:02:28.457Z] Test results: passed: 248; failed: 2
[2024-11-14T05:02:32.935Z] Report written to /home/jenkins/workspace/Test_openjdk11_hs_extended.openjdk_arm_linux_testList_2/aqa-tests/TKG/output_17315397621362/jdk_jmx_2/report/html/report.html
[2024-11-14T05:02:32.935Z] Results written to /home/jenkins/workspace/Test_openjdk11_hs_extended.openjdk_arm_linux_testList_2/aqa-tests/TKG/output_17315397621362/jdk_jmx_2/work
[2024-11-14T05:02:32.935Z] Error: Some tests failed or other problems occurred.
[2024-11-14T05:02:32.935Z] -----------------------------------
[2024-11-14T05:02:32.935Z] jdk_jmx_2_FAILED
[2024-11-14T05:02:32.935Z] -----------------------------------
[2024-11-14T05:02:32.935Z]
[2024-11-14T05:02:32.935Z] TEST TEARDOWN:
[2024-11-14T05:02:32.935Z] Nothing to be done for teardown.
[2024-11-14T05:02:32.935Z] jdk_jmx_2 Finish Time: Thu Nov 14 05:02:32 2024 Epoch Time (ms): 1731560552569