jdk_tools_1
[2025-01-11T17:44:37.432Z] Running test jdk_tools_1 ...
[2025-01-11T17:44:37.432Z] ===============================================
[2025-01-11T17:44:37.432Z] jdk_tools_1 Start Time: Sat Jan 11 17:44:31 2025 Epoch Time (ms): 1736617471269
[2025-01-11T17:44:37.432Z] variation: Mode650
[2025-01-11T17:44:37.432Z] JVM_OPTIONS: -XX:-UseCompressedOops
[2025-01-11T17:44:37.432Z] { \
[2025-01-11T17:44:37.433Z] echo ""; echo "TEST SETUP:"; \
[2025-01-11T17:44:37.433Z] echo "Nothing to be done for setup."; \
[2025-01-11T17:44:37.433Z] mkdir -p "/home/jenkins/workspace/Test_openjdk17_hs_extended.openjdk_riscv64_linux_rerun/aqa-tests/TKG/../TKG/output_17365858889575/jdk_tools_1"; \
[2025-01-11T17:44:37.433Z] cd "/home/jenkins/workspace/Test_openjdk17_hs_extended.openjdk_riscv64_linux_rerun/aqa-tests/TKG/../TKG/output_17365858889575/jdk_tools_1"; \
[2025-01-11T17:44:37.433Z] echo ""; echo "TESTING:"; \
[2025-01-11T17:44:37.433Z] "/home/jenkins/workspace/Test_openjdk17_hs_extended.openjdk_riscv64_linux_rerun/jdkbinary/j2sdk-image/bin/java" -Xmx512m -jar "/home/jenkins/workspace/Test_openjdk17_hs_extended.openjdk_riscv64_linux_rerun/aqa-tests/TKG/../../jvmtest/openjdk/jtreg/lib/jtreg.jar" \
[2025-01-11T17:44:37.433Z] -agentvm -a -ea -esa -v:fail,error,time,nopass -retain:fail,error,*.dmp,javacore.*,heapdump.*,*.trc -ignore:quiet -timeoutFactor:16 -xml:verify -k:'!headful' -concurrency:3 -nativepath:"/home/jenkins/workspace/Test_openjdk17_hs_extended.openjdk_riscv64_linux_rerun/jdkbinary/openjdk-test-image/jdk/jtreg/native" -vmoptions:"-Xmx512m -XX:-UseCompressedOops -Djava.awt.headless=true" \
[2025-01-11T17:44:37.433Z] \
[2025-01-11T17:44:37.433Z] -w ""/home/jenkins/workspace/Test_openjdk17_hs_extended.openjdk_riscv64_linux_rerun/aqa-tests/TKG/../TKG/output_17365858889575/jdk_tools_1"/work" \
[2025-01-11T17:44:37.433Z] -r ""/home/jenkins/workspace/Test_openjdk17_hs_extended.openjdk_riscv64_linux_rerun/aqa-tests/TKG/../TKG/output_17365858889575/jdk_tools_1"/report" \
[2025-01-11T17:44:37.433Z] -jdk:"/home/jenkins/workspace/Test_openjdk17_hs_extended.openjdk_riscv64_linux_rerun/jdkbinary/j2sdk-image" \
[2025-01-11T17:44:37.433Z] -exclude:"/home/jenkins/workspace/Test_openjdk17_hs_extended.openjdk_riscv64_linux_rerun/aqa-tests/TKG/../openjdk/openjdk-jdk/test/jdk/ProblemList.txt" \
[2025-01-11T17:44:37.433Z] -exclude:"/home/jenkins/workspace/Test_openjdk17_hs_extended.openjdk_riscv64_linux_rerun/aqa-tests/TKG/../../jvmtest/openjdk/excludes/ProblemList_openjdk17.txt" \
[2025-01-11T17:44:37.433Z] \
[2025-01-11T17:44:37.433Z] -exclude:"/home/jenkins/workspace/Test_openjdk17_hs_extended.openjdk_riscv64_linux_rerun/aqa-tests/TKG/../openjdk/excludes/vendors/eclipse/ProblemList_openjdk17.txt" \
[2025-01-11T17:44:37.433Z] "/home/jenkins/workspace/Test_openjdk17_hs_extended.openjdk_riscv64_linux_rerun/aqa-tests/TKG/../openjdk/openjdk-jdk/test/jdk:jdk_tools"; \
[2025-01-11T17:44:37.433Z] if [ $? -eq 0 ]; then echo "-----------------------------------"; echo "jdk_tools_1""_PASSED"; echo "-----------------------------------"; cd /home/jenkins/workspace/Test_openjdk17_hs_extended.openjdk_riscv64_linux_rerun/aqa-tests/TKG/..; else echo "-----------------------------------"; echo "jdk_tools_1""_FAILED"; echo "-----------------------------------"; fi; \
[2025-01-11T17:44:37.433Z] echo ""; echo "TEST TEARDOWN:"; \
[2025-01-11T17:44:37.433Z] echo "Nothing to be done for teardown."; \
[2025-01-11T17:44:37.433Z] } 2>&1 | tee -a "/home/jenkins/workspace/Test_openjdk17_hs_extended.openjdk_riscv64_linux_rerun/aqa-tests/TKG/../TKG/output_17365858889575/TestTargetResult";
[2025-01-11T17:44:37.433Z]
[2025-01-11T17:44:37.433Z] TEST SETUP:
[2025-01-11T17:44:37.433Z] Nothing to be done for setup.
[2025-01-11T17:44:37.433Z]
[2025-01-11T17:44:37.433Z] TESTING:
[2025-01-11T17:44:37.433Z] Directory "/home/jenkins/workspace/Test_openjdk17_hs_extended.openjdk_riscv64_linux_rerun/aqa-tests/TKG/../TKG/output_17365858889575/jdk_tools_1/work" not found: creating
[2025-01-11T17:44:37.433Z] Directory "/home/jenkins/workspace/Test_openjdk17_hs_extended.openjdk_riscv64_linux_rerun/aqa-tests/TKG/../TKG/output_17365858889575/jdk_tools_1/report" not found: creating
[2025-01-11T17:45:00.467Z] XML output with verification to /home/jenkins/workspace/Test_openjdk17_hs_extended.openjdk_riscv64_linux_rerun/aqa-tests/TKG/output_17365858889575/jdk_tools_1/work
[2025-01-11T18:49:59.388Z] --------------------------------------------------
[2025-01-11T18:49:59.388Z] TEST: tools/jpackage/linux/LinuxWeirdOutputDirTest.java
[2025-01-11T18:49:59.388Z] TEST JDK: /home/jenkins/workspace/Test_openjdk17_hs_extended.openjdk_riscv64_linux_rerun/jdkbinary/j2sdk-image
[2025-01-11T18:49:59.388Z]
[2025-01-11T18:49:59.388Z] ACTION: build -- Passed. All files up to date
[2025-01-11T18:49:59.388Z] REASON: User specified action: run build jdk.jpackage.test.*
[2025-01-11T18:49:59.388Z] TIME: 0.014 seconds
[2025-01-11T18:49:59.388Z] messages:
[2025-01-11T18:49:59.388Z] command: build jdk.jpackage.test.*
[2025-01-11T18:49:59.388Z] reason: User specified action: run build jdk.jpackage.test.*
[2025-01-11T18:49:59.388Z] started: Sat Jan 11 18:45:49 UTC 2025
[2025-01-11T18:49:59.388Z] finished: Sat Jan 11 18:45:49 UTC 2025
[2025-01-11T18:49:59.388Z] elapsed time (seconds): 0.014
[2025-01-11T18:49:59.388Z]
[2025-01-11T18:49:59.388Z] ACTION: compile -- Passed. Compilation successful
[2025-01-11T18:49:59.388Z] REASON: User specified action: run compile LinuxWeirdOutputDirTest.java
[2025-01-11T18:49:59.388Z] TIME: 0.273 seconds
[2025-01-11T18:49:59.388Z] messages:
[2025-01-11T18:49:59.388Z] command: compile /home/jenkins/workspace/Test_openjdk17_hs_extended.openjdk_riscv64_linux_rerun/aqa-tests/openjdk/openjdk-jdk/test/jdk/tools/jpackage/linux/LinuxWeirdOutputDirTest.java
[2025-01-11T18:49:59.388Z] reason: User specified action: run compile LinuxWeirdOutputDirTest.java
[2025-01-11T18:49:59.388Z] started: Sat Jan 11 18:45:49 UTC 2025
[2025-01-11T18:49:59.388Z] Additional options from @modules: --add-modules jdk.jpackage --add-exports jdk.jpackage/jdk.jpackage.internal=ALL-UNNAMED
[2025-01-11T18:49:59.388Z] Mode: agentvm
[2025-01-11T18:49:59.388Z] Agent id: 2
[2025-01-11T18:49:59.388Z] finished: Sat Jan 11 18:45:49 UTC 2025
[2025-01-11T18:49:59.388Z] elapsed time (seconds): 0.273
[2025-01-11T18:49:59.388Z] configuration:
[2025-01-11T18:49:59.388Z] Boot Layer (javac runtime environment)
[2025-01-11T18:49:59.388Z] class path: /home/jenkins/workspace/Test_openjdk17_hs_extended.openjdk_riscv64_linux_rerun/jvmtest/openjdk/jtreg/lib/javatest.jar
[2025-01-11T18:49:59.388Z] /home/jenkins/workspace/Test_openjdk17_hs_extended.openjdk_riscv64_linux_rerun/jvmtest/openjdk/jtreg/lib/jtreg.jar
[2025-01-11T18:49:59.388Z] patch: java.base /home/jenkins/workspace/Test_openjdk17_hs_extended.openjdk_riscv64_linux_rerun/aqa-tests/TKG/output_17365858889575/jdk_tools_1/work/patches/java.base
[2025-01-11T18:49:59.388Z]
[2025-01-11T18:49:59.388Z] javac compilation environment
[2025-01-11T18:49:59.388Z] add modules: jdk.jpackage
[2025-01-11T18:49:59.388Z] add exports: jdk.jpackage/jdk.jpackage.internal ALL-UNNAMED
[2025-01-11T18:49:59.388Z] source path: /home/jenkins/workspace/Test_openjdk17_hs_extended.openjdk_riscv64_linux_rerun/aqa-tests/openjdk/openjdk-jdk/test/jdk/tools/jpackage/linux
[2025-01-11T18:49:59.388Z] /home/jenkins/workspace/Test_openjdk17_hs_extended.openjdk_riscv64_linux_rerun/aqa-tests/openjdk/openjdk-jdk/test/jdk/tools/jpackage/helpers
[2025-01-11T18:49:59.389Z] class path: /home/jenkins/workspace/Test_openjdk17_hs_extended.openjdk_riscv64_linux_rerun/aqa-tests/openjdk/openjdk-jdk/test/jdk/tools/jpackage/linux
[2025-01-11T18:49:59.389Z] /home/jenkins/workspace/Test_openjdk17_hs_extended.openjdk_riscv64_linux_rerun/aqa-tests/TKG/output_17365858889575/jdk_tools_1/work/classes/2/tools/jpackage/linux/LinuxWeirdOutputDirTest.d
[2025-01-11T18:49:59.389Z] /home/jenkins/workspace/Test_openjdk17_hs_extended.openjdk_riscv64_linux_rerun/aqa-tests/TKG/output_17365858889575/jdk_tools_1/work/classes/2/tools/jpackage/helpers
[2025-01-11T18:49:59.389Z]
[2025-01-11T18:49:59.389Z] rerun:
[2025-01-11T18:49:59.389Z] cd /home/jenkins/workspace/Test_openjdk17_hs_extended.openjdk_riscv64_linux_rerun/aqa-tests/TKG/output_17365858889575/jdk_tools_1/work/scratch/0 && \
[2025-01-11T18:49:59.389Z] DBUS_SESSION_BUS_ADDRESS=unix:path=/run/user/1001/bus \
[2025-01-11T18:49:59.389Z] DISPLAY=:0 \
[2025-01-11T18:49:59.389Z] HOME=/home/jenkins \
[2025-01-11T18:49:59.389Z] LANG=en_US.UTF-8 \
[2025-01-11T18:49:59.389Z] PATH=/bin:/usr/bin:/usr/sbin \
[2025-01-11T18:49:59.389Z] XDG_RUNTIME_DIR=/run/user/1001 \
[2025-01-11T18:49:59.389Z] XDG_SESSION_CLASS=user \
[2025-01-11T18:49:59.389Z] XDG_SESSION_ID=13 \
[2025-01-11T18:49:59.389Z] XDG_SESSION_TYPE=tty \
[2025-01-11T18:49:59.389Z] /home/jenkins/workspace/Test_openjdk17_hs_extended.openjdk_riscv64_linux_rerun/jdkbinary/j2sdk-image/bin/javac \
[2025-01-11T18:49:59.389Z] -J-ea \
[2025-01-11T18:49:59.389Z] -J-esa \
[2025-01-11T18:49:59.389Z] -J-Xmx512m \
[2025-01-11T18:49:59.389Z] -J-XX:-UseCompressedOops \
[2025-01-11T18:49:59.389Z] -J-Djava.awt.headless=true \
[2025-01-11T18:49:59.389Z] -J-Dtest.vm.opts='-ea -esa -Xmx512m -XX:-UseCompressedOops -Djava.awt.headless=true' \
[2025-01-11T18:49:59.389Z] -J-Dtest.tool.vm.opts='-J-ea -J-esa -J-Xmx512m -J-XX:-UseCompressedOops -J-Djava.awt.headless=true' \
[2025-01-11T18:49:59.389Z] -J-Dtest.compiler.opts= \
[2025-01-11T18:49:59.389Z] -J-Dtest.java.opts= \
[2025-01-11T18:49:59.389Z] -J-Dtest.jdk=/home/jenkins/workspace/Test_openjdk17_hs_extended.openjdk_riscv64_linux_rerun/jdkbinary/j2sdk-image \
[2025-01-11T18:49:59.389Z] -J-Dcompile.jdk=/home/jenkins/workspace/Test_openjdk17_hs_extended.openjdk_riscv64_linux_rerun/jdkbinary/j2sdk-image \
[2025-01-11T18:49:59.389Z] -J-Dtest.timeout.factor=16.0 \
[2025-01-11T18:49:59.389Z] -J-Dtest.nativepath=/home/jenkins/workspace/Test_openjdk17_hs_extended.openjdk_riscv64_linux_rerun/jdkbinary/openjdk-test-image/jdk/jtreg/native \
[2025-01-11T18:49:59.389Z] -J-Dtest.root=/home/jenkins/workspace/Test_openjdk17_hs_extended.openjdk_riscv64_linux_rerun/aqa-tests/openjdk/openjdk-jdk/test/jdk \
[2025-01-11T18:49:59.389Z] -J-Dtest.name=tools/jpackage/linux/LinuxWeirdOutputDirTest.java \
[2025-01-11T18:49:59.389Z] -J-Dtest.file=/home/jenkins/workspace/Test_openjdk17_hs_extended.openjdk_riscv64_linux_rerun/aqa-tests/openjdk/openjdk-jdk/test/jdk/tools/jpackage/linux/LinuxWeirdOutputDirTest.java \
[2025-01-11T18:49:59.389Z] -J-Dtest.src=/home/jenkins/workspace/Test_openjdk17_hs_extended.openjdk_riscv64_linux_rerun/aqa-tests/openjdk/openjdk-jdk/test/jdk/tools/jpackage/linux \
[2025-01-11T18:49:59.389Z] -J-Dtest.src.path=/home/jenkins/workspace/Test_openjdk17_hs_extended.openjdk_riscv64_linux_rerun/aqa-tests/openjdk/openjdk-jdk/test/jdk/tools/jpackage/linux:/home/jenkins/workspace/Test_openjdk17_hs_extended.openjdk_riscv64_linux_rerun/aqa-tests/openjdk/openjdk-jdk/test/jdk/tools/jpackage/helpers \
[2025-01-11T18:49:59.389Z] -J-Dtest.classes=/home/jenkins/workspace/Test_openjdk17_hs_extended.openjdk_riscv64_linux_rerun/aqa-tests/TKG/output_17365858889575/jdk_tools_1/work/classes/2/tools/jpackage/linux/LinuxWeirdOutputDirTest.d \
[2025-01-11T18:49:59.389Z] -J-Dtest.class.path=/home/jenkins/workspace/Test_openjdk17_hs_extended.openjdk_riscv64_linux_rerun/aqa-tests/TKG/output_17365858889575/jdk_tools_1/work/classes/2/tools/jpackage/linux/LinuxWeirdOutputDirTest.d:/home/jenkins/workspace/Test_openjdk17_hs_extended.openjdk_riscv64_linux_rerun/aqa-tests/TKG/output_17365858889575/jdk_tools_1/work/classes/2/tools/jpackage/helpers \
[2025-01-11T18:49:59.389Z] -J-Dtest.class.path.prefix=/home/jenkins/workspace/Test_openjdk17_hs_extended.openjdk_riscv64_linux_rerun/aqa-tests/TKG/output_17365858889575/jdk_tools_1/work/classes/2/tools/jpackage/linux/LinuxWeirdOutputDirTest.d:/home/jenkins/workspace/Test_openjdk17_hs_extended.openjdk_riscv64_linux_rerun/aqa-tests/openjdk/openjdk-jdk/test/jdk/tools/jpackage/linux:/home/jenkins/workspace/Test_openjdk17_hs_extended.openjdk_riscv64_linux_rerun/aqa-tests/TKG/output_17365858889575/jdk_tools_1/work/classes/2/tools/jpackage/helpers \
[2025-01-11T18:49:59.389Z] -J-Dtest.modules=jdk.jpackage/jdk.jpackage.internal \
[2025-01-11T18:49:59.389Z] --add-modules jdk.jpackage \
[2025-01-11T18:49:59.389Z] --add-exports jdk.jpackage/jdk.jpackage.internal=ALL-UNNAMED \
[2025-01-11T18:49:59.389Z] -d /home/jenkins/workspace/Test_openjdk17_hs_extended.openjdk_riscv64_linux_rerun/aqa-tests/TKG/output_17365858889575/jdk_tools_1/work/classes/2/tools/jpackage/linux/LinuxWeirdOutputDirTest.d \
[2025-01-11T18:49:59.389Z] -sourcepath /home/jenkins/workspace/Test_openjdk17_hs_extended.openjdk_riscv64_linux_rerun/aqa-tests/openjdk/openjdk-jdk/test/jdk/tools/jpackage/linux:/home/jenkins/workspace/Test_openjdk17_hs_extended.openjdk_riscv64_linux_rerun/aqa-tests/openjdk/openjdk-jdk/test/jdk/tools/jpackage/helpers \
[2025-01-11T18:49:59.389Z] -classpath /home/jenkins/workspace/Test_openjdk17_hs_extended.openjdk_riscv64_linux_rerun/aqa-tests/openjdk/openjdk-jdk/test/jdk/tools/jpackage/linux:/home/jenkins/workspace/Test_openjdk17_hs_extended.openjdk_riscv64_linux_rerun/aqa-tests/TKG/output_17365858889575/jdk_tools_1/work/classes/2/tools/jpackage/linux/LinuxWeirdOutputDirTest.d:/home/jenkins/workspace/Test_openjdk17_hs_extended.openjdk_riscv64_linux_rerun/aqa-tests/TKG/output_17365858889575/jdk_tools_1/work/classes/2/tools/jpackage/helpers /home/jenkins/workspace/Test_openjdk17_hs_extended.openjdk_riscv64_linux_rerun/aqa-tests/openjdk/openjdk-jdk/test/jdk/tools/jpackage/linux/LinuxWeirdOutputDirTest.java
[2025-01-11T18:49:59.389Z]
[2025-01-11T18:49:59.389Z] ACTION: build -- Passed. All files up to date
[2025-01-11T18:49:59.389Z] REASON: Named class compiled on demand
[2025-01-11T18:49:59.389Z] TIME: 0.0 seconds
[2025-01-11T18:49:59.389Z] messages:
[2025-01-11T18:49:59.389Z] command: build jdk.jpackage.test.Main
[2025-01-11T18:49:59.389Z] reason: Named class compiled on demand
[2025-01-11T18:49:59.389Z] started: Sat Jan 11 18:45:49 UTC 2025
[2025-01-11T18:49:59.389Z] finished: Sat Jan 11 18:45:49 UTC 2025
[2025-01-11T18:49:59.389Z] elapsed time (seconds): 0.0
[2025-01-11T18:49:59.389Z]
[2025-01-11T18:49:59.389Z] ACTION: main -- Failed. Execution failed: `main' threw exception: java.lang.RuntimeException: 2 FAILED TESTS
[2025-01-11T18:49:59.389Z] REASON: User specified action: run main/othervm/timeout=540 -Xmx512m jdk.jpackage.test.Main --jpt-run=LinuxWeirdOutputDirTest
[2025-01-11T18:49:59.389Z] TIME: 243.137 seconds
[2025-01-11T18:49:59.389Z] messages:
[2025-01-11T18:49:59.389Z] command: main -Xmx512m jdk.jpackage.test.Main --jpt-run=LinuxWeirdOutputDirTest
[2025-01-11T18:49:59.389Z] reason: User specified action: run main/othervm/timeout=540 -Xmx512m jdk.jpackage.test.Main --jpt-run=LinuxWeirdOutputDirTest
[2025-01-11T18:49:59.389Z] started: Sat Jan 11 18:45:49 UTC 2025
[2025-01-11T18:49:59.389Z] Mode: othervm [/othervm specified]
[2025-01-11T18:49:59.389Z] Additional options from @modules: --add-modules jdk.jpackage --add-exports jdk.jpackage/jdk.jpackage.internal=ALL-UNNAMED
[2025-01-11T18:49:59.389Z] finished: Sat Jan 11 18:49:52 UTC 2025
[2025-01-11T18:49:59.389Z] elapsed time (seconds): 243.137
[2025-01-11T18:49:59.389Z] configuration:
[2025-01-11T18:49:59.389Z] Boot Layer
[2025-01-11T18:49:59.389Z] add modules: jdk.jpackage
[2025-01-11T18:49:59.389Z] add exports: jdk.jpackage/jdk.jpackage.internal ALL-UNNAMED
[2025-01-11T18:49:59.389Z]
[2025-01-11T18:49:59.389Z] STDOUT:
[2025-01-11T18:49:59.389Z] [18:45:51.799] Parsing [--jpt-run=LinuxWeirdOutputDirTest]...
[2025-01-11T18:49:59.389Z] [18:45:52.270] LinuxWeirdOutputDirTest.test -> [public void LinuxWeirdOutputDirTest.test(java.lang.String)]
[2025-01-11T18:49:59.389Z] [18:45:52.545] Create: LinuxWeirdOutputDirTest.test(bin)
[2025-01-11T18:49:59.389Z] [18:45:52.550] Create: LinuxWeirdOutputDirTest.test(lib)
[2025-01-11T18:49:59.389Z] [18:45:52.621] [ RUN ] LinuxWeirdOutputDirTest.test(bin)
[2025-01-11T18:49:59.389Z] [18:45:53.505] TRACE: Bundler deb supported
[2025-01-11T18:49:59.389Z] [18:45:53.771] TRACE: exec: Execute tool provider [javac -d ./test.965ce0cf/jar-workdir /home/jenkins/workspace/Test_openjdk17_hs_extended.openjdk_riscv64_linux_rerun/aqa-tests/openjdk/openjdk-jdk/test/jdk/tools/jpackage/apps/Hello.java](4)...
[2025-01-11T18:49:59.389Z] [18:46:06.240] TRACE: exec: Done. Exit code: 0
[2025-01-11T18:49:59.389Z] [18:46:06.245] TRACE: assertEquals(0): Check command tool provider [javac -d ./test.965ce0cf/jar-workdir /home/jenkins/workspace/Test_openjdk17_hs_extended.openjdk_riscv64_linux_rerun/aqa-tests/openjdk/openjdk-jdk/test/jdk/tools/jpackage/apps/Hello.java](4) exited with 0 code
[2025-01-11T18:49:59.389Z] [18:46:06.258] TRACE: exec: Execute tool provider [jar -c -f ./test.965ce0cf/input/hello.jar -C ./test.965ce0cf/jar-workdir .](7)...
[2025-01-11T18:49:59.389Z] [18:46:06.555] TRACE: exec: Done. Exit code: 0
[2025-01-11T18:49:59.389Z] [18:46:06.558] TRACE: assertEquals(0): Check command tool provider [jar -c -f ./test.965ce0cf/input/hello.jar -C ./test.965ce0cf/jar-workdir .](7) exited with 0 code
[2025-01-11T18:49:59.389Z] [18:46:06.597] TRACE: exec: Execute [/home/jenkins/workspace/Test_openjdk17_hs_extended.openjdk_riscv64_linux_rerun/jdkbinary/j2sdk-image/bin/jpackage --input ./test.965ce0cf/input --dest ./test.965ce0cf/output/bin --name LinuxWeirdOutputDirTest --type app-image --main-jar hello.jar --main-class Hello --verbose](14); inherit I/O...
[2025-01-11T18:49:59.389Z] [18:46:10.020] Running dpkg
[2025-01-11T18:49:59.389Z] [18:46:10.302] Command [PID: 2048996]:
[2025-01-11T18:49:59.389Z] dpkg --print-architecture
[2025-01-11T18:49:59.389Z] [18:46:10.304] Output:
[2025-01-11T18:49:59.389Z] riscv64
[2025-01-11T18:49:59.389Z] [18:46:10.350] Returned: 0
[2025-01-11T18:49:59.389Z]
[2025-01-11T18:49:59.389Z] [18:46:10.696] Creating app package: LinuxWeirdOutputDirTest in /home/jenkins/workspace/Test_openjdk17_hs_extended.openjdk_riscv64_linux_rerun/aqa-tests/TKG/output_17365858889575/jdk_tools_1/work/scratch/0/./test.965ce0cf/output/bin
[2025-01-11T18:49:59.389Z] [18:47:37.075] Command [PID: -1]:
[2025-01-11T18:49:59.390Z] jlink --output ./test.965ce0cf/output/bin/LinuxWeirdOutputDirTest/lib/runtime --module-path /home/jenkins/workspace/Test_openjdk17_hs_extended.openjdk_riscv64_linux_rerun/jdkbinary/j2sdk-image/jmods --add-modules jdk.management.jfr,java.rmi,jdk.jdi,jdk.charsets,java.xml,jdk.xml.dom,java.datatransfer,jdk.jstatd,jdk.httpserver,java.desktop,java.security.sasl,jdk.zipfs,java.base,jdk.crypto.ec,jdk.javadoc,jdk.management.agent,jdk.jshell,jdk.editpad,jdk.jsobject,java.sql.rowset,jdk.sctp,jdk.unsupported,java.smartcardio,jdk.jlink,java.security.jgss,java.compiler,jdk.nio.mapmode,jdk.dynalink,jdk.unsupported.desktop,jdk.accessibility,jdk.security.jgss,jdk.incubator.vector,java.sql,java.xml.crypto,java.transaction.xa,java.logging,jdk.jfr,jdk.crypto.cryptoki,jdk.random,jdk.net,java.naming,jdk.internal.ed,java.prefs,java.net.http,jdk.compiler,jdk.naming.rmi,jdk.internal.opt,jdk.jconsole,jdk.attach,jdk.internal.le,java.management,jdk.jdwp.agent,jdk.internal.jvmstat,jdk.incubator.foreign,java.instrument,jdk.management,jdk.security.auth,java.scripting,jdk.jdeps,jdk.jartool,jdk.jpackage,java.management.rmi,jdk.naming.dns,jdk.localedata --strip-native-commands --strip-debug --no-man-pages --no-header-files
[2025-01-11T18:49:59.390Z] [18:47:37.077] Output:
[2025-01-11T18:49:59.390Z] WARNING: Using incubator modules: jdk.incubator.vector, jdk.incubator.foreign
[2025-01-11T18:49:59.390Z]
[2025-01-11T18:49:59.390Z] [18:47:37.082] Returned: 0
[2025-01-11T18:49:59.390Z]
[2025-01-11T18:49:59.390Z] [18:47:37.258] Using default package resource JavaApp.png [icon] (add LinuxWeirdOutputDirTest.png to the resource-dir to customize).
[2025-01-11T18:49:59.390Z] [18:47:37.540] Succeeded in building Linux Application Image package
[2025-01-11T18:49:59.390Z] [18:47:38.027] TRACE: exec: Done. Exit code: 0
[2025-01-11T18:49:59.390Z] [18:47:38.030] TRACE: assertEquals(0): Check command [/home/jenkins/workspace/Test_openjdk17_hs_extended.openjdk_riscv64_linux_rerun/jdkbinary/j2sdk-image/bin/jpackage --input ./test.965ce0cf/input --dest ./test.965ce0cf/output/bin --name LinuxWeirdOutputDirTest --type app-image --main-jar hello.jar --main-class Hello --verbose](14) exited with 0 code
[2025-01-11T18:49:59.390Z] [18:47:38.364] TRACE: assertStringListEquals(): Check there is only one file with [.jpackage.xml] name in the package
[2025-01-11T18:49:59.390Z] [18:47:38.383] TRACE: assertStringListEquals(1, ./test.965ce0cf/output/bin/LinuxWeirdOutputDirTest/lib/app/.jpackage.xml)
[2025-01-11T18:49:59.390Z] [18:47:38.391] TRACE: assertTrue(): Check [./test.965ce0cf/output/bin/LinuxWeirdOutputDirTest/lib/runtime] path exists
[2025-01-11T18:49:59.390Z] [18:47:38.394] TRACE: assertTrue(): Check [./test.965ce0cf/output/bin/LinuxWeirdOutputDirTest/lib/runtime] is a directory
[2025-01-11T18:49:59.390Z] [18:47:38.402] TRACE: assertTrue(): Check [./test.965ce0cf/output/bin/LinuxWeirdOutputDirTest/bin/LinuxWeirdOutputDirTest] path exists
[2025-01-11T18:49:59.390Z] [18:47:38.404] TRACE: assertTrue(): Check [./test.965ce0cf/output/bin/LinuxWeirdOutputDirTest/bin/LinuxWeirdOutputDirTest] is a file
[2025-01-11T18:49:59.390Z] [18:47:38.406] TRACE: assertTrue(): Check [./test.965ce0cf/output/bin/LinuxWeirdOutputDirTest/bin/LinuxWeirdOutputDirTest] file is executable
[2025-01-11T18:49:59.390Z] [18:47:38.410] TRACE: assertTrue(): Check [./test.965ce0cf/output/bin/LinuxWeirdOutputDirTest/lib/app/LinuxWeirdOutputDirTest.cfg] path exists
[2025-01-11T18:49:59.390Z] [18:47:38.412] TRACE: assertTrue(): Check [./test.965ce0cf/output/bin/LinuxWeirdOutputDirTest/lib/app/LinuxWeirdOutputDirTest.cfg] is a file
[2025-01-11T18:49:59.390Z] [18:47:38.444] TRACE: Clearing PATH in environment
[2025-01-11T18:49:59.390Z] [18:47:38.447] TRACE: exec: Execute [/home/jenkins/workspace/Test_openjdk17_hs_extended.openjdk_riscv64_linux_rerun/aqa-tests/TKG/output_17365858889575/jdk_tools_1/work/scratch/0/./test.965ce0cf/output/bin/LinuxWeirdOutputDirTest/bin/LinuxWeirdOutputDirTest](1); inherit I/O; in directory [./test.965ce0cf]...
[2025-01-11T18:49:59.390Z] hello: Environment supports a display
[2025-01-11T18:49:59.390Z] [18:47:40.029] TRACE: exec: Done. Exit code: 1
[2025-01-11T18:49:59.390Z] [18:47:45.033] TRACE: Clearing PATH in environment
[2025-01-11T18:49:59.390Z] [18:47:45.035] TRACE: exec: Execute [/home/jenkins/workspace/Test_openjdk17_hs_extended.openjdk_riscv64_linux_rerun/aqa-tests/TKG/output_17365858889575/jdk_tools_1/work/scratch/0/./test.965ce0cf/output/bin/LinuxWeirdOutputDirTest/bin/LinuxWeirdOutputDirTest](1); inherit I/O; in directory [./test.965ce0cf]...
[2025-01-11T18:49:59.390Z] hello: Environment supports a display
[2025-01-11T18:49:59.390Z] [18:47:47.629] TRACE: exec: Done. Exit code: 1
[2025-01-11T18:49:59.390Z] [18:47:52.633] TRACE: Clearing PATH in environment
[2025-01-11T18:49:59.390Z] [18:47:52.634] TRACE: exec: Execute [/home/jenkins/workspace/Test_openjdk17_hs_extended.openjdk_riscv64_linux_rerun/aqa-tests/TKG/output_17365858889575/jdk_tools_1/work/scratch/0/./test.965ce0cf/output/bin/LinuxWeirdOutputDirTest/bin/LinuxWeirdOutputDirTest](1); inherit I/O; in directory [./test.965ce0cf]...
[2025-01-11T18:49:59.390Z] hello: Environment supports a display
[2025-01-11T18:49:59.390Z] [18:47:54.867] TRACE: exec: Done. Exit code: 1
[2025-01-11T18:49:59.390Z] [18:47:59.943] ERROR: Expected [0]. Actual [1]: Check command [/home/jenkins/workspace/Test_openjdk17_hs_extended.openjdk_riscv64_linux_rerun/aqa-tests/TKG/output_17365858889575/jdk_tools_1/work/scratch/0/./test.965ce0cf/output/bin/LinuxWeirdOutputDirTest/bin/LinuxWeirdOutputDirTest](1) exited with 0 code
[2025-01-11T18:49:59.390Z] [18:47:59.948] [ FAILED ] LinuxWeirdOutputDirTest.test(bin); checks=12
[2025-01-11T18:49:59.390Z] [18:47:59.964] [ RUN ] LinuxWeirdOutputDirTest.test(lib)
[2025-01-11T18:49:59.390Z] [18:47:59.971] TRACE: exec: Execute tool provider [javac -d ./test.96616b11/jar-workdir /home/jenkins/workspace/Test_openjdk17_hs_extended.openjdk_riscv64_linux_rerun/aqa-tests/openjdk/openjdk-jdk/test/jdk/tools/jpackage/apps/Hello.java](4)...
[2025-01-11T18:49:59.390Z] [18:48:03.486] TRACE: exec: Done. Exit code: 0
[2025-01-11T18:49:59.390Z] [18:48:03.489] TRACE: assertEquals(0): Check command tool provider [javac -d ./test.96616b11/jar-workdir /home/jenkins/workspace/Test_openjdk17_hs_extended.openjdk_riscv64_linux_rerun/aqa-tests/openjdk/openjdk-jdk/test/jdk/tools/jpackage/apps/Hello.java](4) exited with 0 code
[2025-01-11T18:49:59.390Z] [18:48:03.494] TRACE: exec: Execute tool provider [jar -c -f ./test.96616b11/input/hello.jar -C ./test.96616b11/jar-workdir .](7)...
[2025-01-11T18:49:59.390Z] [18:48:03.502] TRACE: exec: Done. Exit code: 0
[2025-01-11T18:49:59.390Z] [18:48:03.504] TRACE: assertEquals(0): Check command tool provider [jar -c -f ./test.96616b11/input/hello.jar -C ./test.96616b11/jar-workdir .](7) exited with 0 code
[2025-01-11T18:49:59.390Z] [18:48:03.509] TRACE: exec: Execute [/home/jenkins/workspace/Test_openjdk17_hs_extended.openjdk_riscv64_linux_rerun/jdkbinary/j2sdk-image/bin/jpackage --input ./test.96616b11/input --dest ./test.96616b11/output/lib --name LinuxWeirdOutputDirTest --type app-image --main-jar hello.jar --main-class Hello --verbose](14); inherit I/O...
[2025-01-11T18:49:59.390Z] [18:48:06.657] Running dpkg
[2025-01-11T18:49:59.390Z] [18:48:06.919] Command [PID: 2049854]:
[2025-01-11T18:49:59.390Z] dpkg --print-architecture
[2025-01-11T18:49:59.390Z] [18:48:06.921] Output:
[2025-01-11T18:49:59.390Z] riscv64
[2025-01-11T18:49:59.390Z] [18:48:06.985] Returned: 0
[2025-01-11T18:49:59.390Z]
[2025-01-11T18:49:59.390Z] [18:48:07.296] Creating app package: LinuxWeirdOutputDirTest in /home/jenkins/workspace/Test_openjdk17_hs_extended.openjdk_riscv64_linux_rerun/aqa-tests/TKG/output_17365858889575/jdk_tools_1/work/scratch/0/./test.96616b11/output/lib
[2025-01-11T18:49:59.390Z] [18:49:29.399] Command [PID: -1]:
[2025-01-11T18:49:59.390Z] jlink --output ./test.96616b11/output/lib/LinuxWeirdOutputDirTest/lib/runtime --module-path /home/jenkins/workspace/Test_openjdk17_hs_extended.openjdk_riscv64_linux_rerun/jdkbinary/j2sdk-image/jmods --add-modules jdk.management.jfr,java.rmi,jdk.jdi,jdk.charsets,java.xml,jdk.xml.dom,java.datatransfer,jdk.jstatd,jdk.httpserver,java.desktop,java.security.sasl,jdk.zipfs,java.base,jdk.crypto.ec,jdk.javadoc,jdk.management.agent,jdk.jshell,jdk.editpad,jdk.jsobject,java.sql.rowset,jdk.sctp,jdk.unsupported,jdk.jlink,java.smartcardio,java.security.jgss,java.compiler,jdk.nio.mapmode,jdk.dynalink,jdk.unsupported.desktop,jdk.accessibility,jdk.security.jgss,jdk.incubator.vector,java.sql,java.xml.crypto,java.transaction.xa,java.logging,jdk.jfr,jdk.crypto.cryptoki,jdk.random,jdk.net,java.naming,jdk.internal.ed,java.prefs,java.net.http,jdk.compiler,jdk.naming.rmi,jdk.internal.opt,jdk.jconsole,jdk.attach,jdk.internal.le,java.management,jdk.jdwp.agent,jdk.internal.jvmstat,jdk.incubator.foreign,java.instrument,jdk.management,jdk.security.auth,java.scripting,jdk.jdeps,jdk.jartool,jdk.jpackage,java.management.rmi,jdk.naming.dns,jdk.localedata --strip-native-commands --strip-debug --no-man-pages --no-header-files
[2025-01-11T18:49:59.390Z] [18:49:29.401] Output:
[2025-01-11T18:49:59.390Z] WARNING: Using incubator modules: jdk.incubator.foreign, jdk.incubator.vector
[2025-01-11T18:49:59.390Z]
[2025-01-11T18:49:59.390Z] [18:49:29.402] Returned: 0
[2025-01-11T18:49:59.390Z]
[2025-01-11T18:49:59.390Z] [18:49:29.481] Using default package resource JavaApp.png [icon] (add LinuxWeirdOutputDirTest.png to the resource-dir to customize).
[2025-01-11T18:49:59.390Z] [18:49:29.708] Succeeded in building Linux Application Image package
[2025-01-11T18:49:59.390Z] [18:49:30.099] TRACE: exec: Done. Exit code: 0
[2025-01-11T18:49:59.390Z] [18:49:30.101] TRACE: assertEquals(0): Check command [/home/jenkins/workspace/Test_openjdk17_hs_extended.openjdk_riscv64_linux_rerun/jdkbinary/j2sdk-image/bin/jpackage --input ./test.96616b11/input --dest ./test.96616b11/output/lib --name LinuxWeirdOutputDirTest --type app-image --main-jar hello.jar --main-class Hello --verbose](14) exited with 0 code
[2025-01-11T18:49:59.390Z] [18:49:30.229] TRACE: assertStringListEquals(): Check there is only one file with [.jpackage.xml] name in the package
[2025-01-11T18:49:59.390Z] [18:49:30.243] TRACE: assertStringListEquals(1, ./test.96616b11/output/lib/LinuxWeirdOutputDirTest/lib/app/.jpackage.xml)
[2025-01-11T18:49:59.391Z] [18:49:30.245] TRACE: assertTrue(): Check [./test.96616b11/output/lib/LinuxWeirdOutputDirTest/lib/runtime] path exists
[2025-01-11T18:49:59.391Z] [18:49:30.247] TRACE: assertTrue(): Check [./test.96616b11/output/lib/LinuxWeirdOutputDirTest/lib/runtime] is a directory
[2025-01-11T18:49:59.391Z] [18:49:30.258] TRACE: assertTrue(): Check [./test.96616b11/output/lib/LinuxWeirdOutputDirTest/bin/LinuxWeirdOutputDirTest] path exists
[2025-01-11T18:49:59.391Z] [18:49:30.260] TRACE: assertTrue(): Check [./test.96616b11/output/lib/LinuxWeirdOutputDirTest/bin/LinuxWeirdOutputDirTest] is a file
[2025-01-11T18:49:59.391Z] [18:49:30.262] TRACE: assertTrue(): Check [./test.96616b11/output/lib/LinuxWeirdOutputDirTest/bin/LinuxWeirdOutputDirTest] file is executable
[2025-01-11T18:49:59.391Z] [18:49:30.278] TRACE: assertTrue(): Check [./test.96616b11/output/lib/LinuxWeirdOutputDirTest/lib/app/LinuxWeirdOutputDirTest.cfg] path exists
[2025-01-11T18:49:59.391Z] [18:49:30.280] TRACE: assertTrue(): Check [./test.96616b11/output/lib/LinuxWeirdOutputDirTest/lib/app/LinuxWeirdOutputDirTest.cfg] is a file
[2025-01-11T18:49:59.391Z] [18:49:30.286] TRACE: Clearing PATH in environment
[2025-01-11T18:49:59.391Z] [18:49:30.288] TRACE: exec: Execute [/home/jenkins/workspace/Test_openjdk17_hs_extended.openjdk_riscv64_linux_rerun/aqa-tests/TKG/output_17365858889575/jdk_tools_1/work/scratch/0/./test.96616b11/output/lib/LinuxWeirdOutputDirTest/bin/LinuxWeirdOutputDirTest](1); inherit I/O; in directory [./test.96616b11]...
[2025-01-11T18:49:59.391Z] hello: Environment supports a display
[2025-01-11T18:49:59.391Z] [18:49:32.164] TRACE: exec: Done. Exit code: 1
[2025-01-11T18:49:59.391Z] [18:49:37.166] TRACE: Clearing PATH in environment
[2025-01-11T18:49:59.391Z] [18:49:37.167] TRACE: exec: Execute [/home/jenkins/workspace/Test_openjdk17_hs_extended.openjdk_riscv64_linux_rerun/aqa-tests/TKG/output_17365858889575/jdk_tools_1/work/scratch/0/./test.96616b11/output/lib/LinuxWeirdOutputDirTest/bin/LinuxWeirdOutputDirTest](1); inherit I/O; in directory [./test.96616b11]...
[2025-01-11T18:49:59.391Z] hello: Environment supports a display
[2025-01-11T18:49:59.391Z] [18:49:40.012] TRACE: exec: Done. Exit code: 1
[2025-01-11T18:49:59.391Z] [18:49:45.015] TRACE: Clearing PATH in environment
[2025-01-11T18:49:59.391Z] [18:49:45.016] TRACE: exec: Execute [/home/jenkins/workspace/Test_openjdk17_hs_extended.openjdk_riscv64_linux_rerun/aqa-tests/TKG/output_17365858889575/jdk_tools_1/work/scratch/0/./test.96616b11/output/lib/LinuxWeirdOutputDirTest/bin/LinuxWeirdOutputDirTest](1); inherit I/O; in directory [./test.96616b11]...
[2025-01-11T18:49:59.391Z] hello: Environment supports a display
[2025-01-11T18:49:59.391Z] [18:49:47.387] TRACE: exec: Done. Exit code: 1
[2025-01-11T18:49:59.391Z] [18:49:52.389] ERROR: Expected [0]. Actual [1]: Check command [/home/jenkins/workspace/Test_openjdk17_hs_extended.openjdk_riscv64_linux_rerun/aqa-tests/TKG/output_17365858889575/jdk_tools_1/work/scratch/0/./test.96616b11/output/lib/LinuxWeirdOutputDirTest/bin/LinuxWeirdOutputDirTest](1) exited with 0 code
[2025-01-11T18:49:59.391Z] [18:49:52.390] [ FAILED ] LinuxWeirdOutputDirTest.test(lib); checks=12
[2025-01-11T18:49:59.391Z] [18:49:52.412] [==========] 2 tests ran
[2025-01-11T18:49:59.391Z] [18:49:52.413] [ PASSED ] 0 tests
[2025-01-11T18:49:59.391Z] [18:49:52.444] [ FAILED ] 2 tests, listed below
[2025-01-11T18:49:59.391Z] [18:49:52.465] [ FAILED ] LinuxWeirdOutputDirTest.test(bin); workDir=[./test.965ce0cf]
[2025-01-11T18:49:59.391Z] [18:49:52.467] [ FAILED ] LinuxWeirdOutputDirTest.test(lib); workDir=[./test.96616b11]
[2025-01-11T18:49:59.391Z] [18:49:52.477] 2 FAILED TESTS
[2025-01-11T18:49:59.391Z] STDERR:
[2025-01-11T18:49:59.391Z] Exception in thread "main" java.lang.UnsatisfiedLinkError: Can't load library: /home/jenkins/workspace/Test_openjdk17_hs_extended.openjdk_riscv64_linux_rerun/aqa-tests/TKG/output_17365858889575/jdk_tools_1/work/scratch/0/test.965ce0cf/output/bin/LinuxWeirdOutputDirTest/lib/runtime/lib/libawt_xawt.so
[2025-01-11T18:49:59.391Z] at java.base/java.lang.ClassLoader.loadLibrary(Unknown Source)
[2025-01-11T18:49:59.391Z] at java.base/java.lang.Runtime.load0(Unknown Source)
[2025-01-11T18:49:59.391Z] at java.base/java.lang.System.load(Unknown Source)
[2025-01-11T18:49:59.391Z] at java.base/jdk.internal.loader.NativeLibraries.load(Native Method)
[2025-01-11T18:49:59.391Z] at java.base/jdk.internal.loader.NativeLibraries$NativeLibraryImpl.open(Unknown Source)
[2025-01-11T18:49:59.391Z] at java.base/jdk.internal.loader.NativeLibraries.loadLibrary(Unknown Source)
[2025-01-11T18:49:59.391Z] at java.base/jdk.internal.loader.NativeLibraries.loadLibrary(Unknown Source)
[2025-01-11T18:49:59.391Z] at java.base/jdk.internal.loader.NativeLibraries.findFromPaths(Unknown Source)
[2025-01-11T18:49:59.391Z] at java.base/jdk.internal.loader.NativeLibraries.loadLibrary(Unknown Source)
[2025-01-11T18:49:59.391Z] at java.base/java.lang.ClassLoader.loadLibrary(Unknown Source)
[2025-01-11T18:49:59.391Z] at java.base/java.lang.Runtime.loadLibrary0(Unknown Source)
[2025-01-11T18:49:59.391Z] at java.base/java.lang.System.loadLibrary(Unknown Source)
[2025-01-11T18:49:59.391Z] at java.desktop/java.awt.Toolkit$2.run(Unknown Source)
[2025-01-11T18:49:59.391Z] at java.desktop/java.awt.Toolkit$2.run(Unknown Source)
[2025-01-11T18:49:59.391Z] at java.base/java.security.AccessController.doPrivileged(Unknown Source)
[2025-01-11T18:49:59.391Z] at java.desktop/java.awt.Toolkit.loadLibraries(Unknown Source)
[2025-01-11T18:49:59.391Z] at java.desktop/java.awt.Toolkit.initStatic(Unknown Source)
[2025-01-11T18:49:59.391Z] at java.desktop/java.awt.Toolkit.<clinit>(Unknown Source)
[2025-01-11T18:49:59.391Z] at java.desktop/java.awt.Desktop.isDesktopSupported(Unknown Source)
[2025-01-11T18:49:59.391Z] at Hello.createInstance(Hello.java:170)
[2025-01-11T18:49:59.391Z] at Hello.<clinit>(Hello.java:161)
[2025-01-11T18:49:59.391Z] Exception in thread "main" java.lang.UnsatisfiedLinkError: Can't load library: /home/jenkins/workspace/Test_openjdk17_hs_extended.openjdk_riscv64_linux_rerun/aqa-tests/TKG/output_17365858889575/jdk_tools_1/work/scratch/0/test.965ce0cf/output/bin/LinuxWeirdOutputDirTest/lib/runtime/lib/libawt_xawt.so
[2025-01-11T18:49:59.391Z] at java.base/java.lang.ClassLoader.loadLibrary(Unknown Source)
[2025-01-11T18:49:59.391Z] at java.base/java.lang.Runtime.load0(Unknown Source)
[2025-01-11T18:49:59.391Z] at java.base/java.lang.System.load(Unknown Source)
[2025-01-11T18:49:59.391Z] at java.base/jdk.internal.loader.NativeLibraries.load(Native Method)
[2025-01-11T18:49:59.391Z] at java.base/jdk.internal.loader.NativeLibraries$NativeLibraryImpl.open(Unknown Source)
[2025-01-11T18:49:59.391Z] at java.base/jdk.internal.loader.NativeLibraries.loadLibrary(Unknown Source)
[2025-01-11T18:49:59.391Z] at java.base/jdk.internal.loader.NativeLibraries.loadLibrary(Unknown Source)
[2025-01-11T18:49:59.391Z] at java.base/jdk.internal.loader.NativeLibraries.findFromPaths(Unknown Source)
[2025-01-11T18:49:59.391Z] at java.base/jdk.internal.loader.NativeLibraries.loadLibrary(Unknown Source)
[2025-01-11T18:49:59.391Z] at java.base/java.lang.ClassLoader.loadLibrary(Unknown Source)
[2025-01-11T18:49:59.391Z] at java.base/java.lang.Runtime.loadLibrary0(Unknown Source)
[2025-01-11T18:49:59.391Z] at java.base/java.lang.System.loadLibrary(Unknown Source)
[2025-01-11T18:49:59.391Z] at java.desktop/java.awt.Toolkit$2.run(Unknown Source)
[2025-01-11T18:49:59.391Z] at java.desktop/java.awt.Toolkit$2.run(Unknown Source)
[2025-01-11T18:49:59.391Z] at java.base/java.security.AccessController.doPrivileged(Unknown Source)
[2025-01-11T18:49:59.391Z] at java.desktop/java.awt.Toolkit.loadLibraries(Unknown Source)
[2025-01-11T18:49:59.391Z] at java.desktop/java.awt.Toolkit.initStatic(Unknown Source)
[2025-01-11T18:49:59.391Z] at java.desktop/java.awt.Toolkit.<clinit>(Unknown Source)
[2025-01-11T18:49:59.391Z] at java.desktop/java.awt.Desktop.isDesktopSupported(Unknown Source)
[2025-01-11T18:49:59.391Z] at Hello.createInstance(Hello.java:170)
[2025-01-11T18:49:59.391Z] at Hello.<clinit>(Hello.java:161)
[2025-01-11T18:49:59.391Z] Exception in thread "main" java.lang.UnsatisfiedLinkError: Can't load library: /home/jenkins/workspace/Test_openjdk17_hs_extended.openjdk_riscv64_linux_rerun/aqa-tests/TKG/output_17365858889575/jdk_tools_1/work/scratch/0/test.965ce0cf/output/bin/LinuxWeirdOutputDirTest/lib/runtime/lib/libawt_xawt.so
[2025-01-11T18:49:59.391Z] at java.base/java.lang.ClassLoader.loadLibrary(Unknown Source)
[2025-01-11T18:49:59.391Z] at java.base/java.lang.Runtime.load0(Unknown Source)
[2025-01-11T18:49:59.391Z] at java.base/java.lang.System.load(Unknown Source)
[2025-01-11T18:49:59.391Z] at java.base/jdk.internal.loader.NativeLibraries.load(Native Method)
[2025-01-11T18:49:59.391Z] at java.base/jdk.internal.loader.NativeLibraries$NativeLibraryImpl.open(Unknown Source)
[2025-01-11T18:49:59.391Z] at java.base/jdk.internal.loader.NativeLibraries.loadLibrary(Unknown Source)
[2025-01-11T18:49:59.391Z] at java.base/jdk.internal.loader.NativeLibraries.loadLibrary(Unknown Source)
[2025-01-11T18:49:59.391Z] at java.base/jdk.internal.loader.NativeLibraries.findFromPaths(Unknown Source)
[2025-01-11T18:49:59.391Z] at java.base/jdk.internal.loader.NativeLibraries.loadLibrary(Unknown Source)
[2025-01-11T18:49:59.391Z] at java.base/java.lang.ClassLoader.loadLibrary(Unknown Source)
[2025-01-11T18:49:59.391Z] at java.base/java.lang.Runtime.loadLibrary0(Unknown Source)
[2025-01-11T18:49:59.391Z] at java.base/java.lang.System.loadLibrary(Unknown Source)
[2025-01-11T18:49:59.391Z] at java.desktop/java.awt.Toolkit$2.run(Unknown Source)
[2025-01-11T18:49:59.391Z] at java.desktop/java.awt.Toolkit$2.run(Unknown Source)
[2025-01-11T18:49:59.391Z] at java.base/java.security.AccessController.doPrivileged(Unknown Source)
[2025-01-11T18:49:59.391Z] at java.desktop/java.awt.Toolkit.loadLibraries(Unknown Source)
[2025-01-11T18:49:59.391Z] at java.desktop/java.awt.Toolkit.initStatic(Unknown Source)
[2025-01-11T18:49:59.391Z] at java.desktop/java.awt.Toolkit.<clinit>(Unknown Source)
[2025-01-11T18:49:59.391Z] at java.desktop/java.awt.Desktop.isDesktopSupported(Unknown Source)
[2025-01-11T18:49:59.391Z] at Hello.createInstance(Hello.java:170)
[2025-01-11T18:49:59.391Z] at Hello.<clinit>(Hello.java:161)
[2025-01-11T18:49:59.391Z] java.lang.AssertionError: Expected [0]. Actual [1]: Check command [/home/jenkins/workspace/Test_openjdk17_hs_extended.openjdk_riscv64_linux_rerun/aqa-tests/TKG/output_17365858889575/jdk_tools_1/work/scratch/0/./test.965ce0cf/output/bin/LinuxWeirdOutputDirTest/bin/LinuxWeirdOutputDirTest](1) exited with 0 code
[2025-01-11T18:49:59.391Z] at jdk.jpackage.test.TKit.error(TKit.java:264)
[2025-01-11T18:49:59.391Z] at jdk.jpackage.test.TKit.assertEquals(TKit.java:567)
[2025-01-11T18:49:59.392Z] at jdk.jpackage.test.Executor$Result.assertExitCodeIs(Executor.java:185)
[2025-01-11T18:49:59.392Z] at jdk.jpackage.test.Executor.executeAndRepeatUntilExitCode(Executor.java:261)
[2025-01-11T18:49:59.392Z] at jdk.jpackage.test.HelloApp$AppOutputVerifier.executeAndVerifyOutput(HelloApp.java:426)
[2025-01-11T18:49:59.392Z] at jdk.jpackage.test.HelloApp$AppOutputVerifier.executeAndVerifyOutput(HelloApp.java:440)
[2025-01-11T18:49:59.392Z] at jdk.jpackage.test.HelloApp.executeLauncherAndVerifyOutput(HelloApp.java:323)
[2025-01-11T18:49:59.392Z] at jdk.jpackage.test.JPackageCommand.executeAndAssertHelloAppImageCreated(JPackageCommand.java:745)
[2025-01-11T18:49:59.392Z] at LinuxWeirdOutputDirTest.test(LinuxWeirdOutputDirTest.java:48)
[2025-01-11T18:49:59.392Z] at java.base/jdk.internal.reflect.NativeMethodAccessorImpl.invoke0(Native Method)
[2025-01-11T18:49:59.392Z] at java.base/jdk.internal.reflect.NativeMethodAccessorImpl.invoke(NativeMethodAccessorImpl.java:77)
[2025-01-11T18:49:59.392Z] at java.base/jdk.internal.reflect.DelegatingMethodAccessorImpl.invoke(DelegatingMethodAccessorImpl.java:43)
[2025-01-11T18:49:59.392Z] at java.base/java.lang.reflect.Method.invoke(Method.java:569)
[2025-01-11T18:49:59.392Z] at jdk.jpackage.test.MethodCall.accept(MethodCall.java:145)
[2025-01-11T18:49:59.392Z] at jdk.jpackage.test.TestInstance.run(TestInstance.java:230)
[2025-01-11T18:49:59.392Z] at jdk.jpackage.test.TKit.lambda$ignoreExceptions$5(TKit.java:139)
[2025-01-11T18:49:59.392Z] at jdk.jpackage.test.TKit.lambda$runTests$3(TKit.java:124)
[2025-01-11T18:49:59.392Z] at java.base/java.util.ArrayList$ArrayListSpliterator.forEachRemaining(ArrayList.java:1625)
[2025-01-11T18:49:59.392Z] at java.base/java.util.stream.ReferencePipeline$Head.forEach(ReferencePipeline.java:762)
[2025-01-11T18:49:59.392Z] at jdk.jpackage.test.TKit.lambda$runTests$4(TKit.java:121)
[2025-01-11T18:49:59.392Z] at jdk.jpackage.test.Functional$ThrowingRunnable.lambda$toRunnable$0(Functional.java:105)
[2025-01-11T18:49:59.392Z] at jdk.jpackage.test.TKit.withExtraLogStream(TKit.java:107)
[2025-01-11T18:49:59.392Z] at jdk.jpackage.test.TKit.runTests(TKit.java:120)
[2025-01-11T18:49:59.392Z] at jdk.jpackage.test.Main.runTests(Main.java:79)
[2025-01-11T18:49:59.392Z] at jdk.jpackage.test.Main.lambda$main$2(Main.java:75)
[2025-01-11T18:49:59.392Z] at jdk.jpackage.test.Functional$ThrowingRunnable.lambda$toRunnable$0(Functional.java:105)
[2025-01-11T18:49:59.392Z] at jdk.jpackage.test.TKit.withExtraLogStream(TKit.java:107)
[2025-01-11T18:49:59.392Z] at jdk.jpackage.test.Main.main(Main.java:75)
[2025-01-11T18:49:59.392Z] at java.base/jdk.internal.reflect.NativeMethodAccessorImpl.invoke0(Native Method)
[2025-01-11T18:49:59.392Z] at java.base/jdk.internal.reflect.NativeMethodAccessorImpl.invoke(NativeMethodAccessorImpl.java:77)
[2025-01-11T18:49:59.392Z] at java.base/jdk.internal.reflect.DelegatingMethodAccessorImpl.invoke(DelegatingMethodAccessorImpl.java:43)
[2025-01-11T18:49:59.392Z] at java.base/java.lang.reflect.Method.invoke(Method.java:569)
[2025-01-11T18:49:59.392Z] at com.sun.javatest.regtest.agent.MainWrapper$MainTask.run(MainWrapper.java:138)
[2025-01-11T18:49:59.392Z] at java.base/java.lang.Thread.run(Thread.java:840)
[2025-01-11T18:49:59.392Z] Exception in thread "main" java.lang.UnsatisfiedLinkError: Can't load library: /home/jenkins/workspace/Test_openjdk17_hs_extended.openjdk_riscv64_linux_rerun/aqa-tests/TKG/output_17365858889575/jdk_tools_1/work/scratch/0/test.96616b11/output/lib/LinuxWeirdOutputDirTest/lib/runtime/lib/libawt_xawt.so
[2025-01-11T18:49:59.392Z] at java.base/java.lang.ClassLoader.loadLibrary(Unknown Source)
[2025-01-11T18:49:59.392Z] at java.base/java.lang.Runtime.load0(Unknown Source)
[2025-01-11T18:49:59.392Z] at java.base/java.lang.System.load(Unknown Source)
[2025-01-11T18:49:59.392Z] at java.base/jdk.internal.loader.NativeLibraries.load(Native Method)
[2025-01-11T18:49:59.392Z] at java.base/jdk.internal.loader.NativeLibraries$NativeLibraryImpl.open(Unknown Source)
[2025-01-11T18:49:59.392Z] at java.base/jdk.internal.loader.NativeLibraries.loadLibrary(Unknown Source)
[2025-01-11T18:49:59.392Z] at java.base/jdk.internal.loader.NativeLibraries.loadLibrary(Unknown Source)
[2025-01-11T18:49:59.392Z] at java.base/jdk.internal.loader.NativeLibraries.findFromPaths(Unknown Source)
[2025-01-11T18:49:59.392Z] at java.base/jdk.internal.loader.NativeLibraries.loadLibrary(Unknown Source)
[2025-01-11T18:49:59.392Z] at java.base/java.lang.ClassLoader.loadLibrary(Unknown Source)
[2025-01-11T18:49:59.392Z] at java.base/java.lang.Runtime.loadLibrary0(Unknown Source)
[2025-01-11T18:49:59.392Z] at java.base/java.lang.System.loadLibrary(Unknown Source)
[2025-01-11T18:49:59.392Z] at java.desktop/java.awt.Toolkit$2.run(Unknown Source)
[2025-01-11T18:49:59.392Z] at java.desktop/java.awt.Toolkit$2.run(Unknown Source)
[2025-01-11T18:49:59.392Z] at java.base/java.security.AccessController.doPrivileged(Unknown Source)
[2025-01-11T18:49:59.392Z] at java.desktop/java.awt.Toolkit.loadLibraries(Unknown Source)
[2025-01-11T18:49:59.392Z] at java.desktop/java.awt.Toolkit.initStatic(Unknown Source)
[2025-01-11T18:49:59.392Z] at java.desktop/java.awt.Toolkit.<clinit>(Unknown Source)
[2025-01-11T18:49:59.392Z] at java.desktop/java.awt.Desktop.isDesktopSupported(Unknown Source)
[2025-01-11T18:49:59.392Z] at Hello.createInstance(Hello.java:170)
[2025-01-11T18:49:59.392Z] at Hello.<clinit>(Hello.java:161)
[2025-01-11T18:49:59.392Z] Exception in thread "main" java.lang.UnsatisfiedLinkError: Can't load library: /home/jenkins/workspace/Test_openjdk17_hs_extended.openjdk_riscv64_linux_rerun/aqa-tests/TKG/output_17365858889575/jdk_tools_1/work/scratch/0/test.96616b11/output/lib/LinuxWeirdOutputDirTest/lib/runtime/lib/libawt_xawt.so
[2025-01-11T18:49:59.392Z] at java.base/java.lang.ClassLoader.loadLibrary(Unknown Source)
[2025-01-11T18:49:59.392Z] at java.base/java.lang.Runtime.load0(Unknown Source)
[2025-01-11T18:49:59.392Z] at java.base/java.lang.System.load(Unknown Source)
[2025-01-11T18:49:59.392Z] at java.base/jdk.internal.loader.NativeLibraries.load(Native Method)
[2025-01-11T18:49:59.392Z] at java.base/jdk.internal.loader.NativeLibraries$NativeLibraryImpl.open(Unknown Source)
[2025-01-11T18:49:59.392Z] at java.base/jdk.internal.loader.NativeLibraries.loadLibrary(Unknown Source)
[2025-01-11T18:49:59.392Z] at java.base/jdk.internal.loader.NativeLibraries.loadLibrary(Unknown Source)
[2025-01-11T18:49:59.392Z] at java.base/jdk.internal.loader.NativeLibraries.findFromPaths(Unknown Source)
[2025-01-11T18:49:59.392Z] at java.base/jdk.internal.loader.NativeLibraries.loadLibrary(Unknown Source)
[2025-01-11T18:49:59.392Z] at java.base/java.lang.ClassLoader.loadLibrary(Unknown Source)
[2025-01-11T18:49:59.392Z] at java.base/java.lang.Runtime.loadLibrary0(Unknown Source)
[2025-01-11T18:49:59.392Z] at java.base/java.lang.System.loadLibrary(Unknown Source)
[2025-01-11T18:49:59.392Z] at java.desktop/java.awt.Toolkit$2.run(Unknown Source)
[2025-01-11T18:49:59.392Z] at java.desktop/java.awt.Toolkit$2.run(Unknown Source)
[2025-01-11T18:49:59.392Z] at java.base/java.security.AccessController.doPrivileged(Unknown Source)
[2025-01-11T18:49:59.392Z] at java.desktop/java.awt.Toolkit.loadLibraries(Unknown Source)
[2025-01-11T18:49:59.392Z] at java.desktop/java.awt.Toolkit.initStatic(Unknown Source)
[2025-01-11T18:49:59.392Z] at java.desktop/java.awt.Toolkit.<clinit>(Unknown Source)
[2025-01-11T18:49:59.392Z] at java.desktop/java.awt.Desktop.isDesktopSupported(Unknown Source)
[2025-01-11T18:49:59.392Z] at Hello.createInstance(Hello.java:170)
[2025-01-11T18:49:59.392Z] at Hello.<clinit>(Hello.java:161)
[2025-01-11T18:49:59.392Z] Exception in thread "main" java.lang.UnsatisfiedLinkError: Can't load library: /home/jenkins/workspace/Test_openjdk17_hs_extended.openjdk_riscv64_linux_rerun/aqa-tests/TKG/output_17365858889575/jdk_tools_1/work/scratch/0/test.96616b11/output/lib/LinuxWeirdOutputDirTest/lib/runtime/lib/libawt_xawt.so
[2025-01-11T18:49:59.392Z] at java.base/java.lang.ClassLoader.loadLibrary(Unknown Source)
[2025-01-11T18:49:59.392Z] at java.base/java.lang.Runtime.load0(Unknown Source)
[2025-01-11T18:49:59.392Z] at java.base/java.lang.System.load(Unknown Source)
[2025-01-11T18:49:59.392Z] at java.base/jdk.internal.loader.NativeLibraries.load(Native Method)
[2025-01-11T18:49:59.392Z] at java.base/jdk.internal.loader.NativeLibraries$NativeLibraryImpl.open(Unknown Source)
[2025-01-11T18:49:59.392Z] at java.base/jdk.internal.loader.NativeLibraries.loadLibrary(Unknown Source)
[2025-01-11T18:49:59.392Z] at java.base/jdk.internal.loader.NativeLibraries.loadLibrary(Unknown Source)
[2025-01-11T18:49:59.392Z] at java.base/jdk.internal.loader.NativeLibraries.findFromPaths(Unknown Source)
[2025-01-11T18:49:59.392Z] at java.base/jdk.internal.loader.NativeLibraries.loadLibrary(Unknown Source)
[2025-01-11T18:49:59.392Z] at java.base/java.lang.ClassLoader.loadLibrary(Unknown Source)
[2025-01-11T18:49:59.392Z] at java.base/java.lang.Runtime.loadLibrary0(Unknown Source)
[2025-01-11T18:49:59.392Z] at java.base/java.lang.System.loadLibrary(Unknown Source)
[2025-01-11T18:49:59.392Z] at java.desktop/java.awt.Toolkit$2.run(Unknown Source)
[2025-01-11T18:49:59.392Z] at java.desktop/java.awt.Toolkit$2.run(Unknown Source)
[2025-01-11T18:49:59.392Z] at java.base/java.security.AccessController.doPrivileged(Unknown Source)
[2025-01-11T18:49:59.392Z] at java.desktop/java.awt.Toolkit.loadLibraries(Unknown Source)
[2025-01-11T18:49:59.392Z] at java.desktop/java.awt.Toolkit.initStatic(Unknown Source)
[2025-01-11T18:49:59.392Z] at java.desktop/java.awt.Toolkit.<clinit>(Unknown Source)
[2025-01-11T18:49:59.392Z] at java.desktop/java.awt.Desktop.isDesktopSupported(Unknown Source)
[2025-01-11T18:49:59.392Z] at Hello.createInstance(Hello.java:170)
[2025-01-11T18:49:59.392Z] at Hello.<clinit>(Hello.java:161)
[2025-01-11T18:49:59.392Z] java.lang.AssertionError: Expected [0]. Actual [1]: Check command [/home/jenkins/workspace/Test_openjdk17_hs_extended.openjdk_riscv64_linux_rerun/aqa-tests/TKG/output_17365858889575/jdk_tools_1/work/scratch/0/./test.96616b11/output/lib/LinuxWeirdOutputDirTest/bin/LinuxWeirdOutputDirTest](1) exited with 0 code
[2025-01-11T18:49:59.392Z] at jdk.jpackage.test.TKit.error(TKit.java:264)
[2025-01-11T18:49:59.392Z] at jdk.jpackage.test.TKit.assertEquals(TKit.java:567)
[2025-01-11T18:49:59.392Z] at jdk.jpackage.test.Executor$Result.assertExitCodeIs(Executor.java:185)
[2025-01-11T18:49:59.392Z] at jdk.jpackage.test.Executor.executeAndRepeatUntilExitCode(Executor.java:261)
[2025-01-11T18:49:59.392Z] at jdk.jpackage.test.HelloApp$AppOutputVerifier.executeAndVerifyOutput(HelloApp.java:426)
[2025-01-11T18:49:59.392Z] at jdk.jpackage.test.HelloApp$AppOutputVerifier.executeAndVerifyOutput(HelloApp.java:440)
[2025-01-11T18:49:59.392Z] at jdk.jpackage.test.HelloApp.executeLauncherAndVerifyOutput(HelloApp.java:323)
[2025-01-11T18:49:59.392Z] at jdk.jpackage.test.JPackageCommand.executeAndAssertHelloAppImageCreated(JPackageCommand.java:745)
[2025-01-11T18:49:59.392Z] at LinuxWeirdOutputDirTest.test(LinuxWeirdOutputDirTest.java:48)
[2025-01-11T18:49:59.392Z] at java.base/jdk.internal.reflect.NativeMethodAccessorImpl.invoke0(Native Method)
[2025-01-11T18:49:59.393Z] at java.base/jdk.internal.reflect.NativeMethodAccessorImpl.invoke(NativeMethodAccessorImpl.java:77)
[2025-01-11T18:49:59.393Z] at java.base/jdk.internal.reflect.DelegatingMethodAccessorImpl.invoke(DelegatingMethodAccessorImpl.java:43)
[2025-01-11T18:49:59.393Z] at java.base/java.lang.reflect.Method.invoke(Method.java:569)
[2025-01-11T18:49:59.393Z] at jdk.jpackage.test.MethodCall.accept(MethodCall.java:145)
[2025-01-11T18:49:59.393Z] at jdk.jpackage.test.TestInstance.run(TestInstance.java:230)
[2025-01-11T18:49:59.393Z] at jdk.jpackage.test.TKit.lambda$ignoreExceptions$5(TKit.java:139)
[2025-01-11T18:49:59.393Z] at jdk.jpackage.test.TKit.lambda$runTests$3(TKit.java:124)
[2025-01-11T18:49:59.393Z] at java.base/java.util.ArrayList$ArrayListSpliterator.forEachRemaining(ArrayList.java:1625)
[2025-01-11T18:49:59.393Z] at java.base/java.util.stream.ReferencePipeline$Head.forEach(ReferencePipeline.java:762)
[2025-01-11T18:49:59.393Z] at jdk.jpackage.test.TKit.lambda$runTests$4(TKit.java:121)
[2025-01-11T18:49:59.393Z] at jdk.jpackage.test.Functional$ThrowingRunnable.lambda$toRunnable$0(Functional.java:105)
[2025-01-11T18:49:59.393Z] at jdk.jpackage.test.TKit.withExtraLogStream(TKit.java:107)
[2025-01-11T18:49:59.393Z] at jdk.jpackage.test.TKit.runTests(TKit.java:120)
[2025-01-11T18:49:59.393Z] at jdk.jpackage.test.Main.runTests(Main.java:79)
[2025-01-11T18:49:59.393Z] at jdk.jpackage.test.Main.lambda$main$2(Main.java:75)
[2025-01-11T18:49:59.393Z] at jdk.jpackage.test.Functional$ThrowingRunnable.lambda$toRunnable$0(Functional.java:105)
[2025-01-11T18:49:59.393Z] at jdk.jpackage.test.TKit.withExtraLogStream(TKit.java:107)
[2025-01-11T18:49:59.393Z] at jdk.jpackage.test.Main.main(Main.java:75)
[2025-01-11T18:49:59.393Z] at java.base/jdk.internal.reflect.NativeMethodAccessorImpl.invoke0(Native Method)
[2025-01-11T18:49:59.393Z] at java.base/jdk.internal.reflect.NativeMethodAccessorImpl.invoke(NativeMethodAccessorImpl.java:77)
[2025-01-11T18:49:59.393Z] at java.base/jdk.internal.reflect.DelegatingMethodAccessorImpl.invoke(DelegatingMethodAccessorImpl.java:43)
[2025-01-11T18:49:59.393Z] at java.base/java.lang.reflect.Method.invoke(Method.java:569)
[2025-01-11T18:49:59.393Z] at com.sun.javatest.regtest.agent.MainWrapper$MainTask.run(MainWrapper.java:138)
[2025-01-11T18:49:59.393Z] at java.base/java.lang.Thread.run(Thread.java:840)
[2025-01-11T18:49:59.393Z] java.lang.RuntimeException: 2 FAILED TESTS
[2025-01-11T18:49:59.393Z] at jdk.jpackage.test.Main.reportSummary(Main.java:130)
[2025-01-11T18:49:59.393Z] at jdk.jpackage.test.Main.runTests(Main.java:90)
[2025-01-11T18:49:59.393Z] at jdk.jpackage.test.Main.lambda$main$2(Main.java:75)
[2025-01-11T18:49:59.393Z] at jdk.jpackage.test.Functional$ThrowingRunnable.lambda$toRunnable$0(Functional.java:105)
[2025-01-11T18:49:59.393Z] at jdk.jpackage.test.TKit.withExtraLogStream(TKit.java:107)
[2025-01-11T18:49:59.393Z] at jdk.jpackage.test.Main.main(Main.java:75)
[2025-01-11T18:49:59.393Z] at java.base/jdk.internal.reflect.NativeMethodAccessorImpl.invoke0(Native Method)
[2025-01-11T18:49:59.393Z] at java.base/jdk.internal.reflect.NativeMethodAccessorImpl.invoke(NativeMethodAccessorImpl.java:77)
[2025-01-11T18:49:59.393Z] at java.base/jdk.internal.reflect.DelegatingMethodAccessorImpl.invoke(DelegatingMethodAccessorImpl.java:43)
[2025-01-11T18:49:59.393Z] at java.base/java.lang.reflect.Method.invoke(Method.java:569)
[2025-01-11T18:49:59.393Z] at com.sun.javatest.regtest.agent.MainWrapper$MainTask.run(MainWrapper.java:138)
[2025-01-11T18:49:59.393Z] at java.base/java.lang.Thread.run(Thread.java:840)
[2025-01-11T18:49:59.393Z]
[2025-01-11T18:49:59.393Z] JavaTest Message: Test threw exception: java.lang.RuntimeException: 2 FAILED TESTS
[2025-01-11T18:49:59.393Z] JavaTest Message: shutting down test
[2025-01-11T18:49:59.393Z]
[2025-01-11T18:49:59.393Z] STATUS:Failed.`main' threw exception: java.lang.RuntimeException: 2 FAILED TESTS
[2025-01-11T18:49:59.393Z] rerun:
[2025-01-11T18:49:59.393Z] cd /home/jenkins/workspace/Test_openjdk17_hs_extended.openjdk_riscv64_linux_rerun/aqa-tests/TKG/output_17365858889575/jdk_tools_1/work/scratch/0 && \
[2025-01-11T18:49:59.393Z] DBUS_SESSION_BUS_ADDRESS=unix:path=/run/user/1001/bus \
[2025-01-11T18:49:59.393Z] DISPLAY=:0 \
[2025-01-11T18:49:59.393Z] HOME=/home/jenkins \
[2025-01-11T18:49:59.393Z] LANG=en_US.UTF-8 \
[2025-01-11T18:49:59.393Z] PATH=/bin:/usr/bin:/usr/sbin \
[2025-01-11T18:49:59.393Z] XDG_RUNTIME_DIR=/run/user/1001 \
[2025-01-11T18:49:59.393Z] XDG_SESSION_CLASS=user \
[2025-01-11T18:49:59.393Z] XDG_SESSION_ID=13 \
[2025-01-11T18:49:59.393Z] XDG_SESSION_TYPE=tty \
[2025-01-11T18:49:59.393Z] CLASSPATH=/home/jenkins/workspace/Test_openjdk17_hs_extended.openjdk_riscv64_linux_rerun/aqa-tests/TKG/output_17365858889575/jdk_tools_1/work/classes/2/tools/jpackage/linux/LinuxWeirdOutputDirTest.d:/home/jenkins/workspace/Test_openjdk17_hs_extended.openjdk_riscv64_linux_rerun/aqa-tests/openjdk/openjdk-jdk/test/jdk/tools/jpackage/linux:/home/jenkins/workspace/Test_openjdk17_hs_extended.openjdk_riscv64_linux_rerun/aqa-tests/TKG/output_17365858889575/jdk_tools_1/work/classes/2/tools/jpackage/helpers:/home/jenkins/workspace/Test_openjdk17_hs_extended.openjdk_riscv64_linux_rerun/aqa-tests/openjdk/openjdk-jdk/test/jdk/tools/jpackage/helpers:/home/jenkins/workspace/Test_openjdk17_hs_extended.openjdk_riscv64_linux_rerun/jvmtest/openjdk/jtreg/lib/javatest.jar:/home/jenkins/workspace/Test_openjdk17_hs_extended.openjdk_riscv64_linux_rerun/jvmtest/openjdk/jtreg/lib/jtreg.jar \
[2025-01-11T18:49:59.393Z] /home/jenkins/workspace/Test_openjdk17_hs_extended.openjdk_riscv64_linux_rerun/jdkbinary/j2sdk-image/bin/java \
[2025-01-11T18:49:59.393Z] -Dtest.vm.opts='-ea -esa -Xmx512m -XX:-UseCompressedOops -Djava.awt.headless=true' \
[2025-01-11T18:49:59.393Z] -Dtest.tool.vm.opts='-J-ea -J-esa -J-Xmx512m -J-XX:-UseCompressedOops -J-Djava.awt.headless=true' \
[2025-01-11T18:49:59.393Z] -Dtest.compiler.opts= \
[2025-01-11T18:49:59.393Z] -Dtest.java.opts= \
[2025-01-11T18:49:59.393Z] -Dtest.jdk=/home/jenkins/workspace/Test_openjdk17_hs_extended.openjdk_riscv64_linux_rerun/jdkbinary/j2sdk-image \
[2025-01-11T18:49:59.393Z] -Dcompile.jdk=/home/jenkins/workspace/Test_openjdk17_hs_extended.openjdk_riscv64_linux_rerun/jdkbinary/j2sdk-image \
[2025-01-11T18:49:59.393Z] -Dtest.timeout.factor=16.0 \
[2025-01-11T18:49:59.393Z] -Dtest.nativepath=/home/jenkins/workspace/Test_openjdk17_hs_extended.openjdk_riscv64_linux_rerun/jdkbinary/openjdk-test-image/jdk/jtreg/native \
[2025-01-11T18:49:59.393Z] -Dtest.root=/home/jenkins/workspace/Test_openjdk17_hs_extended.openjdk_riscv64_linux_rerun/aqa-tests/openjdk/openjdk-jdk/test/jdk \
[2025-01-11T18:49:59.393Z] -Dtest.name=tools/jpackage/linux/LinuxWeirdOutputDirTest.java \
[2025-01-11T18:49:59.393Z] -Dtest.file=/home/jenkins/workspace/Test_openjdk17_hs_extended.openjdk_riscv64_linux_rerun/aqa-tests/openjdk/openjdk-jdk/test/jdk/tools/jpackage/linux/LinuxWeirdOutputDirTest.java \
[2025-01-11T18:49:59.393Z] -Dtest.src=/home/jenkins/workspace/Test_openjdk17_hs_extended.openjdk_riscv64_linux_rerun/aqa-tests/openjdk/openjdk-jdk/test/jdk/tools/jpackage/linux \
[2025-01-11T18:49:59.393Z] -Dtest.src.path=/home/jenkins/workspace/Test_openjdk17_hs_extended.openjdk_riscv64_linux_rerun/aqa-tests/openjdk/openjdk-jdk/test/jdk/tools/jpackage/linux:/home/jenkins/workspace/Test_openjdk17_hs_extended.openjdk_riscv64_linux_rerun/aqa-tests/openjdk/openjdk-jdk/test/jdk/tools/jpackage/helpers \
[2025-01-11T18:49:59.393Z] -Dtest.classes=/home/jenkins/workspace/Test_openjdk17_hs_extended.openjdk_riscv64_linux_rerun/aqa-tests/TKG/output_17365858889575/jdk_tools_1/work/classes/2/tools/jpackage/linux/LinuxWeirdOutputDirTest.d \
[2025-01-11T18:49:59.393Z] -Dtest.class.path=/home/jenkins/workspace/Test_openjdk17_hs_extended.openjdk_riscv64_linux_rerun/aqa-tests/TKG/output_17365858889575/jdk_tools_1/work/classes/2/tools/jpackage/linux/LinuxWeirdOutputDirTest.d:/home/jenkins/workspace/Test_openjdk17_hs_extended.openjdk_riscv64_linux_rerun/aqa-tests/TKG/output_17365858889575/jdk_tools_1/work/classes/2/tools/jpackage/helpers \
[2025-01-11T18:49:59.393Z] -Dtest.class.path.prefix=/home/jenkins/workspace/Test_openjdk17_hs_extended.openjdk_riscv64_linux_rerun/aqa-tests/TKG/output_17365858889575/jdk_tools_1/work/classes/2/tools/jpackage/linux/LinuxWeirdOutputDirTest.d:/home/jenkins/workspace/Test_openjdk17_hs_extended.openjdk_riscv64_linux_rerun/aqa-tests/openjdk/openjdk-jdk/test/jdk/tools/jpackage/linux:/home/jenkins/workspace/Test_openjdk17_hs_extended.openjdk_riscv64_linux_rerun/aqa-tests/TKG/output_17365858889575/jdk_tools_1/work/classes/2/tools/jpackage/helpers \
[2025-01-11T18:49:59.393Z] -Dtest.modules=jdk.jpackage/jdk.jpackage.internal \
[2025-01-11T18:49:59.393Z] --add-modules jdk.jpackage \
[2025-01-11T18:49:59.393Z] --add-exports jdk.jpackage/jdk.jpackage.internal=ALL-UNNAMED \
[2025-01-11T18:49:59.393Z] -ea \
[2025-01-11T18:49:59.393Z] -esa \
[2025-01-11T18:49:59.393Z] -Xmx512m \
[2025-01-11T18:49:59.393Z] -XX:-UseCompressedOops \
[2025-01-11T18:49:59.393Z] -Djava.awt.headless=true \
[2025-01-11T18:49:59.393Z] -Djava.library.path=/home/jenkins/workspace/Test_openjdk17_hs_extended.openjdk_riscv64_linux_rerun/jdkbinary/openjdk-test-image/jdk/jtreg/native \
[2025-01-11T18:49:59.393Z] -Xmx512m \
[2025-01-11T18:49:59.393Z] com.sun.javatest.regtest.agent.MainWrapper /home/jenkins/workspace/Test_openjdk17_hs_extended.openjdk_riscv64_linux_rerun/aqa-tests/TKG/output_17365858889575/jdk_tools_1/work/tools/jpackage/linux/LinuxWeirdOutputDirTest.d/main.0.jta --jpt-run=LinuxWeirdOutputDirTest
[2025-01-11T18:49:59.393Z]
[2025-01-11T18:49:59.393Z] TEST RESULT: Failed. Execution failed: `main' threw exception: java.lang.RuntimeException: 2 FAILED TESTS
[2025-01-11T18:49:59.393Z] --------------------------------------------------
[2025-01-11T19:35:06.228Z] Test results: passed: 242; failed: 1
[2025-01-11T19:35:46.245Z] Report written to /home/jenkins/workspace/Test_openjdk17_hs_extended.openjdk_riscv64_linux_rerun/aqa-tests/TKG/output_17365858889575/jdk_tools_1/report/html/report.html
[2025-01-11T19:35:46.245Z] Results written to /home/jenkins/workspace/Test_openjdk17_hs_extended.openjdk_riscv64_linux_rerun/aqa-tests/TKG/output_17365858889575/jdk_tools_1/work
[2025-01-11T19:35:46.245Z] Error: Some tests failed or other problems occurred.
[2025-01-11T19:35:46.245Z] -----------------------------------
[2025-01-11T19:35:46.245Z] jdk_tools_1_FAILED
[2025-01-11T19:35:46.245Z] -----------------------------------
[2025-01-11T19:35:46.245Z]
[2025-01-11T19:35:46.245Z] TEST TEARDOWN:
[2025-01-11T19:35:46.245Z] Nothing to be done for teardown.
[2025-01-11T19:35:46.245Z] jdk_tools_1 Finish Time: Sat Jan 11 19:35:41 2025 Epoch Time (ms): 1736624141042