PatMod_Adv_1
[2025-02-05T23:36:08.821Z] Running test PatMod_Adv_1 ...
[2025-02-05T23:36:09.493Z] ===============================================
[2025-02-05T23:36:09.493Z] PatMod_Adv_1 Start Time: Wed Feb 5 17:36:09 2025 Epoch Time (ms): 1738798569170
[2025-02-05T23:36:09.493Z] variation: Mode650
[2025-02-05T23:36:09.493Z] JVM_OPTIONS: -XX:-UseCompressedOops
[2025-02-05T23:36:09.493Z] { \
[2025-02-05T23:36:09.493Z] echo ""; echo "TEST SETUP:"; \
[2025-02-05T23:36:09.494Z] echo "Nothing to be done for setup."; \
[2025-02-05T23:36:09.494Z] mkdir -p "/home/jenkins/workspace/Test_openjdk11_hs_sanity.system_x86-64_linux_testList_0/aqa-tests/TKG/../TKG/output_17387985249884/PatMod_Adv_1"; \
[2025-02-05T23:36:09.494Z] cd "/home/jenkins/workspace/Test_openjdk11_hs_sanity.system_x86-64_linux_testList_0/aqa-tests/TKG/../TKG/output_17387985249884/PatMod_Adv_1"; \
[2025-02-05T23:36:09.494Z] echo ""; echo "TESTING:"; \
[2025-02-05T23:36:09.494Z] perl /home/jenkins/workspace/Test_openjdk11_hs_sanity.system_x86-64_linux_testList_0/aqa-tests/TKG/../../jvmtest/system/modularity/..//STF/stf.core/scripts/stf.pl -test-root="/home/jenkins/workspace/Test_openjdk11_hs_sanity.system_x86-64_linux_testList_0/aqa-tests/TKG/../../jvmtest/system/modularity/..//STF;/home/jenkins/workspace/Test_openjdk11_hs_sanity.system_x86-64_linux_testList_0/aqa-tests/TKG/../../jvmtest/system/modularity/..//aqa-systemtest""" -systemtest-prereqs="/home/jenkins/workspace/Test_openjdk11_hs_sanity.system_x86-64_linux_testList_0/../../testDependency/system_lib/" -java-args=' -XX:-UseCompressedOops ' -results-root="/home/jenkins/workspace/Test_openjdk11_hs_sanity.system_x86-64_linux_testList_0/aqa-tests/TKG/../TKG/output_17387985249884/PatMod_Adv_1" -test=PatModTest -test-args="variant=Adv"; \
[2025-02-05T23:36:09.494Z] if [ $? -eq 0 ]; then echo "-----------------------------------"; echo "PatMod_Adv_1""_PASSED"; echo "-----------------------------------"; cd /home/jenkins/workspace/Test_openjdk11_hs_sanity.system_x86-64_linux_testList_0/aqa-tests/TKG/..; rm -f -r "/home/jenkins/workspace/Test_openjdk11_hs_sanity.system_x86-64_linux_testList_0/aqa-tests/TKG/../TKG/output_17387985249884/PatMod_Adv_1"; else echo "-----------------------------------"; echo "PatMod_Adv_1""_FAILED"; echo "-----------------------------------"; fi; \
[2025-02-05T23:36:09.494Z] echo ""; echo "TEST TEARDOWN:"; \
[2025-02-05T23:36:09.494Z] echo "Nothing to be done for teardown."; \
[2025-02-05T23:36:09.494Z] } 2>&1 | tee -a "/home/jenkins/workspace/Test_openjdk11_hs_sanity.system_x86-64_linux_testList_0/aqa-tests/TKG/../TKG/output_17387985249884/TestTargetResult";
[2025-02-05T23:36:09.494Z]
[2025-02-05T23:36:09.494Z] TEST SETUP:
[2025-02-05T23:36:09.494Z] Nothing to be done for setup.
[2025-02-05T23:36:09.494Z]
[2025-02-05T23:36:09.494Z] TESTING:
[2025-02-05T23:36:09.494Z] STF 17:36:09.321 - ========================= S T F =========================
[2025-02-05T23:36:09.494Z] systemtest-prereqs has been processed, and set to: /home/jenkins/testDependency/system_libRetrieving amount of free space on drive containing /home/jenkins/workspace/Test_openjdk11_hs_sanity.system_x86-64_linux_testList_0/aqa-tests/TKG/../TKG/output_17387985249884/PatMod_Adv_1
[2025-02-05T23:36:09.494Z] There is 40993 Mb free
[2025-02-05T23:36:09.494Z] STF 17:36:09.340 - ================== G E N E R A T I O N ==================
[2025-02-05T23:36:09.494Z] STF 17:36:09.342 - Checking JVM: /home/jenkins/workspace/Test_openjdk11_hs_sanity.system_x86-64_linux_testList_0/jdkbinary/j2sdk-image
[2025-02-05T23:36:09.494Z] STF 17:36:09.342 - Starting process to generate scripts: /home/jenkins/workspace/Test_openjdk11_hs_sanity.system_x86-64_linux_testList_0/jdkbinary/j2sdk-image/bin/java -Dlog4j.skipJansi=true -Djava.system.class.loader=net.adoptopenjdk.stf.runner.StfClassLoader -Dload.agent.path=/home/jenkins/workspace/Test_openjdk11_hs_sanity.system_x86-64_linux_testList_0/jvmtest/system/STF/stf.core/scripts/../../stf.load/bin/stf.load.jar -classpath /home/jenkins/workspace/Test_openjdk11_hs_sanity.system_x86-64_linux_testList_0/../../testDependency/system_lib//asm/asm.jar:/home/jenkins/workspace/Test_openjdk11_hs_sanity.system_x86-64_linux_testList_0/../../testDependency/system_lib//asm/asm-commons.jar:/home/jenkins/workspace/Test_openjdk11_hs_sanity.system_x86-64_linux_testList_0/../../testDependency/system_lib//log4j/log4j-api.jar:/home/jenkins/workspace/Test_openjdk11_hs_sanity.system_x86-64_linux_testList_0/../../testDependency/system_lib//log4j/log4j-core.jar:/home/jenkins/workspace/Test_openjdk11_hs_sanity.system_x86-64_linux_testList_0/jvmtest/system/STF/stf.core/scripts/../bin net.adoptopenjdk.stf.runner.StfRunner -properties "/home/jenkins/workspace/Test_openjdk11_hs_sanity.system_x86-64_linux_testList_0/aqa-tests/TKG/../TKG/output_17387985249884/PatMod_Adv_1/20250205-173609-PatModTest/stf_parameters.properties, , /home/jenkins/workspace/Test_openjdk11_hs_sanity.system_x86-64_linux_testList_0/jvmtest/system/STF/stf.core/config/stf.properties" -testDir "/home/jenkins/workspace/Test_openjdk11_hs_sanity.system_x86-64_linux_testList_0/aqa-tests/TKG/../TKG/output_17387985249884/PatMod_Adv_1/20250205-173609-PatModTest"
[2025-02-05T23:36:10.165Z] GEN 17:36:10.447 - Found test. Project: 'openjdk.test.modularity' class: 'PatModTest.class' Dir: '/home/jenkins/workspace/Test_openjdk11_hs_sanity.system_x86-64_linux_testList_0/jvmtest/system/aqa-systemtest/openjdk.test.modularity/bin'
[2025-02-05T23:36:10.837Z] GEN 17:36:10.464 - Found test. Project: 'openjdk.test.modularity' class: 'net.adoptopenjdk.test.modularity.PatModTest'
[2025-02-05T23:36:10.837Z] GEN Classpath directories used by project 'openjdk.test.modularity':
[2025-02-05T23:36:10.837Z] GEN /home/jenkins/workspace/Test_openjdk11_hs_sanity.system_x86-64_linux_testList_0/jvmtest/system/aqa-systemtest/openjdk.test.modularity/bin/common-mods/displayService
[2025-02-05T23:36:10.837Z] GEN /home/jenkins/workspace/Test_openjdk11_hs_sanity.system_x86-64_linux_testList_0/jvmtest/system/aqa-systemtest/openjdk.test.modularity/bin/common-mods/com.helper
[2025-02-05T23:36:10.837Z] GEN /home/jenkins/workspace/Test_openjdk11_hs_sanity.system_x86-64_linux_testList_0/jvmtest/system/aqa-systemtest/openjdk.test.modularity/bin/common-mods/displayServiceImpl1
[2025-02-05T23:36:10.837Z] GEN /home/jenkins/workspace/Test_openjdk11_hs_sanity.system_x86-64_linux_testList_0/jvmtest/system/aqa-systemtest/openjdk.test.modularity/bin/common-mods/com.discreet
[2025-02-05T23:36:10.837Z] GEN /home/jenkins/workspace/Test_openjdk11_hs_sanity.system_x86-64_linux_testList_0/jvmtest/system/aqa-systemtest/openjdk.test.modularity/bin/common-mods/com.hello
[2025-02-05T23:36:10.837Z] GEN /home/jenkins/workspace/Test_openjdk11_hs_sanity.system_x86-64_linux_testList_0/jvmtest/system/aqa-systemtest/openjdk.test.modularity/bin/common-mods/com.hola
[2025-02-05T23:36:10.837Z] GEN /home/jenkins/workspace/Test_openjdk11_hs_sanity.system_x86-64_linux_testList_0/jvmtest/system/aqa-systemtest/openjdk.test.modularity/bin/common-mods/displayServiceImpl2
[2025-02-05T23:36:10.837Z] GEN /home/jenkins/workspace/Test_openjdk11_hs_sanity.system_x86-64_linux_testList_0/jvmtest/system/aqa-systemtest/openjdk.test.modularity/bin/common-mods/com.hi
[2025-02-05T23:36:10.837Z] GEN /home/jenkins/workspace/Test_openjdk11_hs_sanity.system_x86-64_linux_testList_0/jvmtest/system/aqa-systemtest/openjdk.test.modularity/bin/common-override
[2025-02-05T23:36:10.837Z] GEN /home/jenkins/workspace/Test_openjdk11_hs_sanity.system_x86-64_linux_testList_0/jvmtest/system/aqa-systemtest/openjdk.test.modularity/bin/common-override-new
[2025-02-05T23:36:10.837Z] GEN /home/jenkins/workspace/Test_openjdk11_hs_sanity.system_x86-64_linux_testList_0/jvmtest/system/aqa-systemtest/openjdk.test.modularity/bin/common/displayServiceImpl3
[2025-02-05T23:36:10.837Z] GEN /home/jenkins/workspace/Test_openjdk11_hs_sanity.system_x86-64_linux_testList_0/jvmtest/system/aqa-systemtest/openjdk.test.modularity/bin/common/displayServiceImpl4
[2025-02-05T23:36:10.837Z] GEN /home/jenkins/workspace/Test_openjdk11_hs_sanity.system_x86-64_linux_testList_0/jvmtest/system/aqa-systemtest/openjdk.test.modularity/bin/common
[2025-02-05T23:36:10.837Z] GEN /home/jenkins/workspace/Test_openjdk11_hs_sanity.system_x86-64_linux_testList_0/jvmtest/system/aqa-systemtest/openjdk.test.modularity/bin/tests
[2025-02-05T23:36:10.837Z] GEN /home/jenkins/workspace/Test_openjdk11_hs_sanity.system_x86-64_linux_testList_0/jvmtest/system/aqa-systemtest/openjdk.test.modularity/bin
[2025-02-05T23:36:10.837Z] GEN /home/jenkins/workspace/Test_openjdk11_hs_sanity.system_x86-64_linux_testList_0/jvmtest/system/STF/stf.core/bin
[2025-02-05T23:36:10.837Z] GEN /home/jenkins/testDependency/system_lib/log4j/log4j-api.jar
[2025-02-05T23:36:10.837Z] GEN /home/jenkins/testDependency/system_lib/log4j/log4j-core.jar
[2025-02-05T23:36:10.837Z] GEN /home/jenkins/testDependency/system_lib/junit/junit.jar
[2025-02-05T23:36:10.837Z] GEN 17:36:10.734 - Using Mode NoOptions. Values = ''
[2025-02-05T23:36:10.837Z] GEN 17:36:10.881 -
[2025-02-05T23:36:10.837Z] GEN 17:36:10.881 - Test command summary:
[2025-02-05T23:36:10.837Z] GEN 17:36:10.881 - Step Stage Command Description
[2025-02-05T23:36:10.837Z] GEN 17:36:10.882 - -----+--------+-----------------+------------
[2025-02-05T23:36:10.837Z] GEN 17:36:10.882 - 1 execute jar Create com.hello jar
[2025-02-05T23:36:10.837Z] GEN 17:36:10.882 - 2 execute jar Create com.discreet jar
[2025-02-05T23:36:10.837Z] GEN 17:36:10.882 - 3 execute jar create java.xml.jar
[2025-02-05T23:36:10.837Z] GEN 17:36:10.882 - 4 execute Run java Run application class override test where we specify two exploded module paths in a single --patch-module option
[2025-02-05T23:36:10.837Z] GEN 17:36:10.882 - 5 execute Run java (Negative test) Verify if a module can be specified only once on --patch-module
[2025-02-05T23:36:10.837Z] GEN 17:36:10.882 - 6 execute Run java Combine stderr and stdout files of process OT7
[2025-02-05T23:36:10.837Z] GEN 17:36:10.882 - 7 execute count Check output
[2025-02-05T23:36:10.837Z] GEN 17:36:10.882 - 8 execute Run java (Negative test) Verify if --patch-module allows replacing of module-info.class
[2025-02-05T23:36:10.837Z] GEN 17:36:10.882 - 9 execute count Check output
[2025-02-05T23:36:10.837Z] STF 17:36:10.933 -
[2025-02-05T23:36:10.837Z] STF 17:36:10.933 - Script generation completed
[2025-02-05T23:36:10.837Z] STF 17:36:10.934 -
[2025-02-05T23:36:10.837Z] STF 17:36:10.935 -
[2025-02-05T23:36:10.837Z] STF 17:36:10.935 - ======================= S E T U P =======================
[2025-02-05T23:36:10.838Z] STF 17:36:10.936 - Running setup: perl /home/jenkins/workspace/Test_openjdk11_hs_sanity.system_x86-64_linux_testList_0/aqa-tests/TKG/../TKG/output_17387985249884/PatMod_Adv_1/20250205-173609-PatModTest/setUp.pl
[2025-02-05T23:36:10.838Z] STF 17:36:11.015 - SETUP stage completed
[2025-02-05T23:36:10.838Z] STF 17:36:11.023 -
[2025-02-05T23:36:10.838Z] STF 17:36:11.023 - ==================== E X E C U T E - ====================
[2025-02-05T23:36:10.838Z] STF 17:36:11.023 - Running execute: perl /home/jenkins/workspace/Test_openjdk11_hs_sanity.system_x86-64_linux_testList_0/aqa-tests/TKG/../TKG/output_17387985249884/PatMod_Adv_1/20250205-173609-PatModTest/execute.pl
[2025-02-05T23:36:10.838Z] STF 17:36:11.099 -
[2025-02-05T23:36:10.838Z] STF 17:36:11.099 - Java version
[2025-02-05T23:36:10.838Z] STF 17:36:11.099 - Running: /home/jenkins/workspace/Test_openjdk11_hs_sanity.system_x86-64_linux_testList_0/jdkbinary/j2sdk-image/bin/java -version
[2025-02-05T23:36:11.510Z] openjdk version "11.0.27-beta" 2025-04-15
[2025-02-05T23:36:11.510Z] OpenJDK Runtime Environment Temurin-11.0.27+1-202502052108 (build 11.0.27-beta+1-ea)
[2025-02-05T23:36:11.510Z] OpenJDK 64-Bit Server VM Temurin-11.0.27+1-202502052108 (build 11.0.27-beta+1-ea, mixed mode)
[2025-02-05T23:36:11.510Z] STF 17:36:11.268 -
[2025-02-05T23:36:11.510Z] STF 17:36:11.269 - +------ Step 1 - Create com.hello jar
[2025-02-05T23:36:11.510Z] STF 17:36:11.269 - | Create modular jar
[2025-02-05T23:36:11.510Z] STF 17:36:11.269 - | ModuleSpec: openjdk.test.modularity/bin/common-override/com.hello
[2025-02-05T23:36:11.510Z] STF 17:36:11.269 - | ModuleVersion: null
[2025-02-05T23:36:11.510Z] STF 17:36:11.269 - | MainClass: null
[2025-02-05T23:36:11.510Z] STF 17:36:11.269 - | HashModules: null
[2025-02-05T23:36:11.510Z] STF 17:36:11.269 - |
[2025-02-05T23:36:11.510Z] STF 17:36:11.272 - Running command: /home/jenkins/workspace/Test_openjdk11_hs_sanity.system_x86-64_linux_testList_0/jdkbinary/j2sdk-image/bin/jar --create --file /home/jenkins/workspace/Test_openjdk11_hs_sanity.system_x86-64_linux_testList_0/aqa-tests/TKG/output_17387985249884/PatMod_Adv_1/20250205-173609-PatModTest/modules/1.com.hello.jar -C /home/jenkins/workspace/Test_openjdk11_hs_sanity.system_x86-64_linux_testList_0/jvmtest/system/aqa-systemtest/openjdk.test.modularity/bin/common-override/com.hello .
[2025-02-05T23:36:11.510Z] STF 17:36:11.272 - Redirecting stderr to /home/jenkins/workspace/Test_openjdk11_hs_sanity.system_x86-64_linux_testList_0/aqa-tests/TKG/output_17387985249884/PatMod_Adv_1/20250205-173609-PatModTest/results/1.CMJ.stderr
[2025-02-05T23:36:11.510Z] STF 17:36:11.272 - Redirecting stdout to /home/jenkins/workspace/Test_openjdk11_hs_sanity.system_x86-64_linux_testList_0/aqa-tests/TKG/output_17387985249884/PatMod_Adv_1/20250205-173609-PatModTest/results/1.CMJ.stdout
[2025-02-05T23:36:11.510Z] STF 17:36:11.297 - Monitoring processes: CMJ
[2025-02-05T23:36:11.510Z] STF 17:36:11.617 - Monitoring Report Summary:
[2025-02-05T23:36:11.510Z] STF 17:36:11.617 - o Process CMJ ended with the expected exit code (0)
[2025-02-05T23:36:11.510Z] STF 17:36:11.618 - Created modular jar: 1.com.hello.jar
[2025-02-05T23:36:11.510Z] STF 17:36:11.618 -
[2025-02-05T23:36:11.510Z] STF 17:36:11.618 - +------ Step 2 - Create com.discreet jar
[2025-02-05T23:36:11.510Z] STF 17:36:11.618 - | Create modular jar
[2025-02-05T23:36:11.510Z] STF 17:36:11.618 - | ModuleSpec: openjdk.test.modularity/bin/common-override/com.discreet
[2025-02-05T23:36:11.510Z] STF 17:36:11.618 - | ModuleVersion: null
[2025-02-05T23:36:11.510Z] STF 17:36:11.618 - | MainClass: null
[2025-02-05T23:36:11.510Z] STF 17:36:11.618 - | HashModules: null
[2025-02-05T23:36:11.510Z] STF 17:36:11.618 - |
[2025-02-05T23:36:11.510Z] STF 17:36:11.618 - Running command: /home/jenkins/workspace/Test_openjdk11_hs_sanity.system_x86-64_linux_testList_0/jdkbinary/j2sdk-image/bin/jar --create --file /home/jenkins/workspace/Test_openjdk11_hs_sanity.system_x86-64_linux_testList_0/aqa-tests/TKG/output_17387985249884/PatMod_Adv_1/20250205-173609-PatModTest/modules/2.com.discreet.jar -C /home/jenkins/workspace/Test_openjdk11_hs_sanity.system_x86-64_linux_testList_0/jvmtest/system/aqa-systemtest/openjdk.test.modularity/bin/common-override/com.discreet .
[2025-02-05T23:36:11.510Z] STF 17:36:11.618 - Redirecting stderr to /home/jenkins/workspace/Test_openjdk11_hs_sanity.system_x86-64_linux_testList_0/aqa-tests/TKG/output_17387985249884/PatMod_Adv_1/20250205-173609-PatModTest/results/2.CMJ.stderr
[2025-02-05T23:36:11.510Z] STF 17:36:11.619 - Redirecting stdout to /home/jenkins/workspace/Test_openjdk11_hs_sanity.system_x86-64_linux_testList_0/aqa-tests/TKG/output_17387985249884/PatMod_Adv_1/20250205-173609-PatModTest/results/2.CMJ.stdout
[2025-02-05T23:36:11.510Z] STF 17:36:11.627 - Monitoring processes: CMJ
[2025-02-05T23:36:12.183Z] STF 17:36:11.941 - Monitoring Report Summary:
[2025-02-05T23:36:12.183Z] STF 17:36:11.941 - o Process CMJ ended with the expected exit code (0)
[2025-02-05T23:36:12.183Z] STF 17:36:11.942 - Created modular jar: 2.com.discreet.jar
[2025-02-05T23:36:12.183Z] STF 17:36:11.942 -
[2025-02-05T23:36:12.183Z] STF 17:36:11.942 - +------ Step 3 - create java.xml.jar
[2025-02-05T23:36:12.183Z] STF 17:36:11.942 - | Create modular jar
[2025-02-05T23:36:12.183Z] STF 17:36:11.942 - | ModuleSpec: openjdk.test.modularity/bin/common-override/java.xml
[2025-02-05T23:36:12.183Z] STF 17:36:11.942 - | ModuleVersion: null
[2025-02-05T23:36:12.183Z] STF 17:36:11.942 - | MainClass: null
[2025-02-05T23:36:12.183Z] STF 17:36:11.942 - | HashModules: null
[2025-02-05T23:36:12.183Z] STF 17:36:11.942 - |
[2025-02-05T23:36:12.183Z] STF 17:36:11.943 - Running command: /home/jenkins/workspace/Test_openjdk11_hs_sanity.system_x86-64_linux_testList_0/jdkbinary/j2sdk-image/bin/jar --create --file /home/jenkins/workspace/Test_openjdk11_hs_sanity.system_x86-64_linux_testList_0/aqa-tests/TKG/output_17387985249884/PatMod_Adv_1/20250205-173609-PatModTest/modules/3.java.xml.jar -C /home/jenkins/workspace/Test_openjdk11_hs_sanity.system_x86-64_linux_testList_0/jvmtest/system/aqa-systemtest/openjdk.test.modularity/bin/common-override/java.xml .
[2025-02-05T23:36:12.183Z] STF 17:36:11.943 - Redirecting stderr to /home/jenkins/workspace/Test_openjdk11_hs_sanity.system_x86-64_linux_testList_0/aqa-tests/TKG/output_17387985249884/PatMod_Adv_1/20250205-173609-PatModTest/results/3.CMJ.stderr
[2025-02-05T23:36:12.183Z] STF 17:36:11.943 - Redirecting stdout to /home/jenkins/workspace/Test_openjdk11_hs_sanity.system_x86-64_linux_testList_0/aqa-tests/TKG/output_17387985249884/PatMod_Adv_1/20250205-173609-PatModTest/results/3.CMJ.stdout
[2025-02-05T23:36:12.183Z] STF 17:36:11.952 - Monitoring processes: CMJ
[2025-02-05T23:36:12.183Z] STF 17:36:12.277 - Monitoring Report Summary:
[2025-02-05T23:36:12.183Z] STF 17:36:12.277 - o Process CMJ ended with the expected exit code (0)
[2025-02-05T23:36:12.183Z] STF 17:36:12.278 - Created modular jar: 3.java.xml.jar
[2025-02-05T23:36:12.183Z] STF 17:36:12.278 -
[2025-02-05T23:36:12.183Z] STF 17:36:12.278 - +------ Step 4 - Run application class override test where we specify two exploded module paths in a single --patch-module option
[2025-02-05T23:36:12.183Z] STF 17:36:12.278 - | Run foreground process
[2025-02-05T23:36:12.183Z] STF 17:36:12.278 - | Program: /home/jenkins/workspace/Test_openjdk11_hs_sanity.system_x86-64_linux_testList_0/jdkbinary/j2sdk-image/bin/java
[2025-02-05T23:36:12.183Z] STF 17:36:12.278 - | Mnemonic: OT56
[2025-02-05T23:36:12.183Z] STF 17:36:12.278 - | Echo: ECHO_ON
[2025-02-05T23:36:12.183Z] STF 17:36:12.278 - | Expectation: CLEAN_RUN within 1m
[2025-02-05T23:36:12.183Z] STF 17:36:12.278 - |
[2025-02-05T23:36:12.183Z] STF 17:36:12.280 - Running command: /home/jenkins/workspace/Test_openjdk11_hs_sanity.system_x86-64_linux_testList_0/jdkbinary/j2sdk-image/bin/java --add-reads com.test=ALL-UNNAMED --module-path /home/jenkins/workspace/Test_openjdk11_hs_sanity.system_x86-64_linux_testList_0/jvmtest/system/aqa-systemtest/openjdk.test.modularity/bin/common-mods:/home/jenkins/workspace/Test_openjdk11_hs_sanity.system_x86-64_linux_testList_0/jvmtest/system/aqa-systemtest/openjdk.test.modularity/bin/tests --add-modules=com.test --add-exports com.hello/adoptopenjdk.test.modularity.newpkg=com.test --patch-module com.hello=/home/jenkins/workspace/Test_openjdk11_hs_sanity.system_x86-64_linux_testList_0/jvmtest/system/aqa-systemtest/openjdk.test.modularity/bin/common-override/com.hello:/home/jenkins/workspace/Test_openjdk11_hs_sanity.system_x86-64_linux_testList_0/jvmtest/system/aqa-systemtest/openjdk.test.modularity/bin/common-override-new/com.hello -XX:-UseCompressedOops -classpath /home/jenkins/testDependency/system_lib/junit/junit.jar:/home/jenkins/testDependency/system_lib/junit/hamcrest-core.jar org.junit.runner.JUnitCore net.adoptopenjdk.test.modularity.junit.TestOverrideUsingMultipleFilePaths
[2025-02-05T23:36:12.183Z] STF 17:36:12.280 - Redirecting stderr to /home/jenkins/workspace/Test_openjdk11_hs_sanity.system_x86-64_linux_testList_0/aqa-tests/TKG/output_17387985249884/PatMod_Adv_1/20250205-173609-PatModTest/results/4.OT56.stderr
[2025-02-05T23:36:12.183Z] STF 17:36:12.280 - Redirecting stdout to /home/jenkins/workspace/Test_openjdk11_hs_sanity.system_x86-64_linux_testList_0/aqa-tests/TKG/output_17387985249884/PatMod_Adv_1/20250205-173609-PatModTest/results/4.OT56.stdout
[2025-02-05T23:36:12.183Z] STF 17:36:12.291 - Monitoring processes: OT56
[2025-02-05T23:36:12.853Z] OT56 stderr WARNING: module-info.class ignored in patch: /home/jenkins/workspace/Test_openjdk11_hs_sanity.system_x86-64_linux_testList_0/jvmtest/system/aqa-systemtest/openjdk.test.modularity/bin/common-override/com.hello
[2025-02-05T23:36:12.853Z] OT56 stderr WARNING: module-info.class ignored in patch: /home/jenkins/workspace/Test_openjdk11_hs_sanity.system_x86-64_linux_testList_0/jvmtest/system/aqa-systemtest/openjdk.test.modularity/bin/common-override-new/com.hello
[2025-02-05T23:36:12.853Z] OT56 JUnit version 4.12
[2025-02-05T23:36:12.853Z] OT56 ...
[2025-02-05T23:36:12.853Z] OT56 Time: 0.01
[2025-02-05T23:36:12.853Z] OT56
[2025-02-05T23:36:12.853Z] OT56 OK (3 tests)
[2025-02-05T23:36:12.853Z] OT56
[2025-02-05T23:36:12.853Z] STF 17:36:12.828 - Monitoring Report Summary:
[2025-02-05T23:36:12.853Z] STF 17:36:12.828 - o Process OT56 ended with the expected exit code (0)
[2025-02-05T23:36:12.853Z] STF 17:36:12.828 -
[2025-02-05T23:36:12.853Z] STF 17:36:12.829 - +------ Step 5 - (Negative test) Verify if a module can be specified only once on --patch-module
[2025-02-05T23:36:12.853Z] STF 17:36:12.829 - | Run foreground process
[2025-02-05T23:36:12.853Z] STF 17:36:12.829 - | Program: /home/jenkins/workspace/Test_openjdk11_hs_sanity.system_x86-64_linux_testList_0/jdkbinary/j2sdk-image/bin/java
[2025-02-05T23:36:12.853Z] STF 17:36:12.829 - | Mnemonic: OT7
[2025-02-05T23:36:12.853Z] STF 17:36:12.829 - | Echo: ECHO_ON
[2025-02-05T23:36:12.853Z] STF 17:36:12.829 - | Expectation: NON_ZERO_EXIT [1] within 1m
[2025-02-05T23:36:12.853Z] STF 17:36:12.829 - |
[2025-02-05T23:36:12.853Z] STF 17:36:12.830 - Running command: /home/jenkins/workspace/Test_openjdk11_hs_sanity.system_x86-64_linux_testList_0/jdkbinary/j2sdk-image/bin/java --add-reads com.test=ALL-UNNAMED --module-path /home/jenkins/workspace/Test_openjdk11_hs_sanity.system_x86-64_linux_testList_0/jvmtest/system/aqa-systemtest/openjdk.test.modularity/bin/common-mods:/home/jenkins/workspace/Test_openjdk11_hs_sanity.system_x86-64_linux_testList_0/jvmtest/system/aqa-systemtest/openjdk.test.modularity/bin/tests --add-modules=com.test --patch-module com.hello=/home/jenkins/workspace/Test_openjdk11_hs_sanity.system_x86-64_linux_testList_0/jvmtest/system/aqa-systemtest/openjdk.test.modularity/bin/common-override-new/com.hello --patch-module com.hello=/home/jenkins/workspace/Test_openjdk11_hs_sanity.system_x86-64_linux_testList_0/jvmtest/system/aqa-systemtest/openjdk.test.modularity/bin/common-override/com.hello -XX:-UseCompressedOops -classpath /home/jenkins/testDependency/system_lib/junit/junit.jar:/home/jenkins/testDependency/system_lib/junit/hamcrest-core.jar org.junit.runner.JUnitCore net.adoptopenjdk.test.modularity.junit.TestOverrideUsingAppModule
[2025-02-05T23:36:12.853Z] STF 17:36:12.830 - Redirecting stderr to /home/jenkins/workspace/Test_openjdk11_hs_sanity.system_x86-64_linux_testList_0/aqa-tests/TKG/output_17387985249884/PatMod_Adv_1/20250205-173609-PatModTest/results/5.OT7.stderr
[2025-02-05T23:36:12.853Z] STF 17:36:12.830 - Redirecting stdout to /home/jenkins/workspace/Test_openjdk11_hs_sanity.system_x86-64_linux_testList_0/aqa-tests/TKG/output_17387985249884/PatMod_Adv_1/20250205-173609-PatModTest/results/5.OT7.stdout
[2025-02-05T23:36:12.853Z] STF 17:36:12.841 - Monitoring processes: OT7
[2025-02-05T23:36:12.853Z] OT7 Error occurred during initialization of boot layer
[2025-02-05T23:36:12.853Z] OT7 java.lang.ExceptionInInitializerError
[2025-02-05T23:36:12.853Z] OT7 Caused by: java.lang.RuntimeException: com.hello specified more than once to --patch-module
[2025-02-05T23:36:12.853Z] STF 17:36:12.991 - Monitoring Report Summary:
[2025-02-05T23:36:12.853Z] STF 17:36:12.991 - o Process OT7 ended with the expected exit code (1)
[2025-02-05T23:36:12.853Z] STF 17:36:12.991 -
[2025-02-05T23:36:12.853Z] STF 17:36:12.991 - +------ Step 6 - Combine stderr and stdout files of process OT7
[2025-02-05T23:36:12.853Z] STF 17:36:12.992 - | Run foreground process
[2025-02-05T23:36:12.853Z] STF 17:36:12.992 - | Program: /home/jenkins/workspace/Test_openjdk11_hs_sanity.system_x86-64_linux_testList_0/jdkbinary/j2sdk-image/bin/java
[2025-02-05T23:36:12.853Z] STF 17:36:12.992 - | Mnemonic: CO
[2025-02-05T23:36:12.853Z] STF 17:36:12.992 - | Echo: ECHO_OFF
[2025-02-05T23:36:12.853Z] STF 17:36:12.992 - | Expectation: NON_ZERO_EXIT [0] within 30s
[2025-02-05T23:36:12.853Z] STF 17:36:12.992 - |
[2025-02-05T23:36:12.853Z] STF 17:36:12.993 - Running command: /home/jenkins/workspace/Test_openjdk11_hs_sanity.system_x86-64_linux_testList_0/jdkbinary/j2sdk-image/bin/java -Dfile1=/home/jenkins/workspace/Test_openjdk11_hs_sanity.system_x86-64_linux_testList_0/aqa-tests/TKG/output_17387985249884/PatMod_Adv_1/20250205-173609-PatModTest/results/5.OT7.stdout -Dfile2=/home/jenkins/workspace/Test_openjdk11_hs_sanity.system_x86-64_linux_testList_0/aqa-tests/TKG/output_17387985249884/PatMod_Adv_1/20250205-173609-PatModTest/results/5.OT7.stderr -Dfinal.file=/home/jenkins/workspace/Test_openjdk11_hs_sanity.system_x86-64_linux_testList_0/aqa-tests/TKG/output_17387985249884/PatMod_Adv_1/20250205-173609-PatModTest/results/combinedOT7.txt -XX:-UseCompressedOops -classpath /home/jenkins/workspace/Test_openjdk11_hs_sanity.system_x86-64_linux_testList_0/jvmtest/system/STF/stf.core/bin:/home/jenkins/workspace/Test_openjdk11_hs_sanity.system_x86-64_linux_testList_0/jvmtest/system/aqa-systemtest/openjdk.test.modularity/bin net.adoptopenjdk.test.modularity.TestUtil
[2025-02-05T23:36:12.853Z] STF 17:36:12.993 - Redirecting stderr to /home/jenkins/workspace/Test_openjdk11_hs_sanity.system_x86-64_linux_testList_0/aqa-tests/TKG/output_17387985249884/PatMod_Adv_1/20250205-173609-PatModTest/results/6.CO.stderr
[2025-02-05T23:36:12.853Z] STF 17:36:12.993 - Redirecting stdout to /home/jenkins/workspace/Test_openjdk11_hs_sanity.system_x86-64_linux_testList_0/aqa-tests/TKG/output_17387985249884/PatMod_Adv_1/20250205-173609-PatModTest/results/6.CO.stdout
[2025-02-05T23:36:12.853Z] STF 17:36:13.004 - Monitoring processes: CO
[2025-02-05T23:36:13.523Z] STF 17:36:13.249 - Monitoring Report Summary:
[2025-02-05T23:36:13.523Z] STF 17:36:13.249 - o Process CO ended with the expected exit code (0)
[2025-02-05T23:36:13.523Z] STF 17:36:13.250 -
[2025-02-05T23:36:13.523Z] STF 17:36:13.250 - +------ Step 7 - Check output
[2025-02-05T23:36:13.523Z] STF 17:36:13.250 - | Count file matches
[2025-02-05T23:36:13.523Z] STF 17:36:13.250 - | TargetFile: /home/jenkins/workspace/Test_openjdk11_hs_sanity.system_x86-64_linux_testList_0/aqa-tests/TKG/output_17387985249884/PatMod_Adv_1/20250205-173609-PatModTest/results/combinedOT7.txt
[2025-02-05T23:36:13.523Z] STF 17:36:13.250 - | ExpectedNumMatches: 1
[2025-02-05T23:36:13.523Z] STF 17:36:13.250 - | SearchStrings: ["java.lang.ExceptionInInitializerError"]
[2025-02-05T23:36:13.523Z] STF 17:36:13.250 - |
[2025-02-05T23:36:13.523Z] STF 17:36:13.250 - Found 1 instances of ["java.lang.ExceptionInInitializerError"]
[2025-02-05T23:36:13.523Z] STF 17:36:13.250 -
[2025-02-05T23:36:13.523Z] STF 17:36:13.250 - +------ Step 8 - (Negative test) Verify if --patch-module allows replacing of module-info.class
[2025-02-05T23:36:13.523Z] STF 17:36:13.250 - | Run foreground process
[2025-02-05T23:36:13.523Z] STF 17:36:13.251 - | Program: /home/jenkins/workspace/Test_openjdk11_hs_sanity.system_x86-64_linux_testList_0/jdkbinary/j2sdk-image/bin/java
[2025-02-05T23:36:13.523Z] STF 17:36:13.251 - | Mnemonic: OT8
[2025-02-05T23:36:13.523Z] STF 17:36:13.251 - | Echo: ECHO_ON
[2025-02-05T23:36:13.523Z] STF 17:36:13.251 - | Expectation: NON_ZERO_EXIT [1] within 1m
[2025-02-05T23:36:13.523Z] STF 17:36:13.251 - |
[2025-02-05T23:36:13.523Z] STF 17:36:13.252 - Running command: /home/jenkins/workspace/Test_openjdk11_hs_sanity.system_x86-64_linux_testList_0/jdkbinary/j2sdk-image/bin/java --add-reads com.test=ALL-UNNAMED --module-path /home/jenkins/workspace/Test_openjdk11_hs_sanity.system_x86-64_linux_testList_0/jvmtest/system/aqa-systemtest/openjdk.test.modularity/bin/common-mods:/home/jenkins/workspace/Test_openjdk11_hs_sanity.system_x86-64_linux_testList_0/jvmtest/system/aqa-systemtest/openjdk.test.modularity/bin/tests --add-modules=com.test --patch-module com.hello=/home/jenkins/workspace/Test_openjdk11_hs_sanity.system_x86-64_linux_testList_0/jvmtest/system/aqa-systemtest/openjdk.test.modularity/bin/common-override-new/com.hello -XX:-UseCompressedOops -classpath /home/jenkins/testDependency/system_lib/junit/junit.jar:/home/jenkins/testDependency/system_lib/junit/hamcrest-core.jar org.junit.runner.JUnitCore net.adoptopenjdk.test.modularity.junit.TestOverrideUsingUnexportedPublicType
[2025-02-05T23:36:13.523Z] STF 17:36:13.252 - Redirecting stderr to /home/jenkins/workspace/Test_openjdk11_hs_sanity.system_x86-64_linux_testList_0/aqa-tests/TKG/output_17387985249884/PatMod_Adv_1/20250205-173609-PatModTest/results/8.OT8.stderr
[2025-02-05T23:36:13.523Z] STF 17:36:13.252 - Redirecting stdout to /home/jenkins/workspace/Test_openjdk11_hs_sanity.system_x86-64_linux_testList_0/aqa-tests/TKG/output_17387985249884/PatMod_Adv_1/20250205-173609-PatModTest/results/8.OT8.stdout
[2025-02-05T23:36:13.523Z] STF 17:36:13.264 - Monitoring processes: OT8
[2025-02-05T23:36:13.523Z] OT8 stderr WARNING: module-info.class ignored in patch: /home/jenkins/workspace/Test_openjdk11_hs_sanity.system_x86-64_linux_testList_0/jvmtest/system/aqa-systemtest/openjdk.test.modularity/bin/common-override-new/com.hello
[2025-02-05T23:36:13.523Z] OT8 JUnit version 4.12
[2025-02-05T23:36:13.523Z] OT8 .E
[2025-02-05T23:36:13.523Z] OT8 Time: 0.007
[2025-02-05T23:36:13.523Z] OT8 There was 1 failure:
[2025-02-05T23:36:13.523Z] OT8 1) testPatchingOfNewClassInExistingPackage(net.adoptopenjdk.test.modularity.junit.TestOverrideUsingUnexportedPublicType)
[2025-02-05T23:36:13.523Z] OT8 java.lang.IllegalAccessException: class net.adoptopenjdk.test.modularity.junit.TestOverrideUsingUnexportedPublicType (in module com.test) cannot access class adoptopenjdk.test.modularity.newpkg.NewClass2 (in module com.hello) because module com.hello does not export adoptopenjdk.test.modularity.newpkg to module com.test
[2025-02-05T23:36:13.523Z] OT8 at java.base/jdk.internal.reflect.Reflection.newIllegalAccessException(Reflection.java:361)
[2025-02-05T23:36:13.523Z] OT8 at java.base/java.lang.reflect.AccessibleObject.checkAccess(AccessibleObject.java:591)
[2025-02-05T23:36:13.523Z] OT8 at java.base/java.lang.reflect.Constructor.newInstance(Constructor.java:481)
[2025-02-05T23:36:13.523Z] OT8 at com.test/net.adoptopenjdk.test.modularity.junit.TestOverrideUsingUnexportedPublicType.testPatchingOfNewClassInExistingPackage(TestOverrideUsingUnexportedPublicType.java:34)
[2025-02-05T23:36:13.523Z] OT8 at java.base/jdk.internal.reflect.NativeMethodAccessorImpl.invoke0(Native Method)
[2025-02-05T23:36:13.523Z] OT8 at java.base/jdk.internal.reflect.NativeMethodAccessorImpl.invoke(NativeMethodAccessorImpl.java:62)
[2025-02-05T23:36:13.523Z] OT8 at java.base/jdk.internal.reflect.DelegatingMethodAccessorImpl.invoke(DelegatingMethodAccessorImpl.java:43)
[2025-02-05T23:36:13.523Z] OT8 at java.base/java.lang.reflect.Method.invoke(Method.java:566)
[2025-02-05T23:36:13.523Z] OT8 at org.junit.runners.model.FrameworkMethod$1.runReflectiveCall(FrameworkMethod.java:50)
[2025-02-05T23:36:13.523Z] OT8 at org.junit.internal.runners.model.ReflectiveCallable.run(ReflectiveCallable.java:12)
[2025-02-05T23:36:13.523Z] OT8 at org.junit.runners.model.FrameworkMethod.invokeExplosively(FrameworkMethod.java:47)
[2025-02-05T23:36:13.523Z] OT8 at org.junit.internal.runners.statements.InvokeMethod.evaluate(InvokeMethod.java:17)
[2025-02-05T23:36:13.523Z] OT8 at org.junit.runners.ParentRunner.runLeaf(ParentRunner.java:325)
[2025-02-05T23:36:13.523Z] OT8 at org.junit.runners.BlockJUnit4ClassRunner.runChild(BlockJUnit4ClassRunner.java:78)
[2025-02-05T23:36:13.523Z] OT8 at org.junit.runners.BlockJUnit4ClassRunner.runChild(BlockJUnit4ClassRunner.java:57)
[2025-02-05T23:36:13.523Z] OT8 at org.junit.runners.ParentRunner$3.run(ParentRunner.java:290)
[2025-02-05T23:36:13.523Z] OT8 at org.junit.runners.ParentRunner$1.schedule(ParentRunner.java:71)
[2025-02-05T23:36:13.523Z] OT8 at org.junit.runners.ParentRunner.runChildren(ParentRunner.java:288)
[2025-02-05T23:36:13.523Z] OT8 at org.junit.runners.ParentRunner.access$000(ParentRunner.java:58)
[2025-02-05T23:36:13.523Z] OT8 at org.junit.runners.ParentRunner$2.evaluate(ParentRunner.java:268)
[2025-02-05T23:36:13.523Z] OT8 at org.junit.runners.ParentRunner.run(ParentRunner.java:363)
[2025-02-05T23:36:13.523Z] OT8 at org.junit.runners.Suite.runChild(Suite.java:128)
[2025-02-05T23:36:13.523Z] OT8 at org.junit.runners.Suite.runChild(Suite.java:27)
[2025-02-05T23:36:13.523Z] OT8 at org.junit.runners.ParentRunner$3.run(ParentRunner.java:290)
[2025-02-05T23:36:13.523Z] OT8 at org.junit.runners.ParentRunner$1.schedule(ParentRunner.java:71)
[2025-02-05T23:36:13.523Z] OT8 at org.junit.runners.ParentRunner.runChildren(ParentRunner.java:288)
[2025-02-05T23:36:13.523Z] OT8 at org.junit.runners.ParentRunner.access$000(ParentRunner.java:58)
[2025-02-05T23:36:13.523Z] OT8 at org.junit.runners.ParentRunner$2.evaluate(ParentRunner.java:268)
[2025-02-05T23:36:13.523Z] OT8 at org.junit.runners.ParentRunner.run(ParentRunner.java:363)
[2025-02-05T23:36:13.523Z] OT8 at org.junit.runner.JUnitCore.run(JUnitCore.java:137)
[2025-02-05T23:36:13.523Z] OT8 at org.junit.runner.JUnitCore.run(JUnitCore.java:115)
[2025-02-05T23:36:13.523Z] OT8 at org.junit.runner.JUnitCore.runMain(JUnitCore.java:77)
[2025-02-05T23:36:13.523Z] OT8 at org.junit.runner.JUnitCore.main(JUnitCore.java:36)
[2025-02-05T23:36:13.523Z] OT8
[2025-02-05T23:36:13.523Z] OT8 FAILURES!!!
[2025-02-05T23:36:13.523Z] OT8 Tests run: 1, Failures: 1
[2025-02-05T23:36:13.523Z] OT8
[2025-02-05T23:36:13.523Z] STF 17:36:13.700 - Monitoring Report Summary:
[2025-02-05T23:36:13.523Z] STF 17:36:13.701 - o Process OT8 ended with the expected exit code (1)
[2025-02-05T23:36:13.523Z] STF 17:36:13.701 -
[2025-02-05T23:36:13.523Z] STF 17:36:13.701 - +------ Step 9 - Check output
[2025-02-05T23:36:13.523Z] STF 17:36:13.701 - | Count file matches
[2025-02-05T23:36:13.523Z] STF 17:36:13.701 - | TargetFile: /home/jenkins/workspace/Test_openjdk11_hs_sanity.system_x86-64_linux_testList_0/aqa-tests/TKG/output_17387985249884/PatMod_Adv_1/20250205-173609-PatModTest/results/8.OT8.stdout
[2025-02-05T23:36:13.523Z] STF 17:36:13.701 - | ExpectedNumMatches: 1
[2025-02-05T23:36:13.523Z] STF 17:36:13.701 - | SearchStrings: ["java.lang.IllegalAccessException"]
[2025-02-05T23:36:13.523Z] STF 17:36:13.702 - |
[2025-02-05T23:36:13.523Z] STF 17:36:13.702 - Found 1 instances of ["java.lang.IllegalAccessException"]
[2025-02-05T23:36:13.523Z] STF 17:36:13.702 - EXECUTE stage completed
[2025-02-05T23:36:13.523Z] STF 17:36:13.715 -
[2025-02-05T23:36:13.523Z] STF 17:36:13.715 - ==================== T E A R D O W N ====================
[2025-02-05T23:36:13.523Z] STF 17:36:13.716 - Running teardown: perl /home/jenkins/workspace/Test_openjdk11_hs_sanity.system_x86-64_linux_testList_0/aqa-tests/TKG/../TKG/output_17387985249884/PatMod_Adv_1/20250205-173609-PatModTest/tearDown.pl
[2025-02-05T23:36:13.523Z] STF 17:36:13.801 - TEARDOWN stage completed
[2025-02-05T23:36:13.523Z] STF 17:36:13.812 -
[2025-02-05T23:36:13.523Z] STF 17:36:13.812 - ===================== R E S U L T S =====================
[2025-02-05T23:36:13.523Z] STF 17:36:13.812 - Stage results:
[2025-02-05T23:36:13.523Z] STF 17:36:13.813 - setUp: pass
[2025-02-05T23:36:13.523Z] STF 17:36:13.813 - execute: pass
[2025-02-05T23:36:13.523Z] STF 17:36:13.813 - teardown: pass
[2025-02-05T23:36:13.523Z] STF 17:36:13.813 -
[2025-02-05T23:36:13.523Z] STF 17:36:13.813 - Overall result: PASSED
[2025-02-05T23:36:14.194Z] -----------------------------------
[2025-02-05T23:36:14.194Z] PatMod_Adv_1_PASSED
[2025-02-05T23:36:14.194Z] -----------------------------------
[2025-02-05T23:36:14.194Z]
[2025-02-05T23:36:14.194Z] TEST TEARDOWN:
[2025-02-05T23:36:14.194Z] Nothing to be done for teardown.
[2025-02-05T23:36:14.194Z] PatMod_Adv_1 Finish Time: Wed Feb 5 17:36:13 2025 Epoch Time (ms): 1738798573877