jdk_net_1
[2025-02-06T14:55:18.136Z] Running test jdk_net_1 ...
[2025-02-06T14:55:18.136Z] ===============================================
[2025-02-06T14:55:18.136Z] jdk_net_1 Start Time: Thu Feb 6 14:55:17 2025 Epoch Time (ms): 1738853717268
[2025-02-06T14:55:18.136Z] variation: Mode650
[2025-02-06T14:55:18.136Z] JVM_OPTIONS: -XX:-UseCompressedOops
[2025-02-06T14:55:18.136Z] { \
[2025-02-06T14:55:18.136Z] echo ""; echo "TEST SETUP:"; \
[2025-02-06T14:55:18.136Z] echo "Nothing to be done for setup."; \
[2025-02-06T14:55:18.136Z] mkdir -p "/home/jenkins/workspace/Test_openjdk11_hs_extended.openjdk_s390x_linux_testList_4/aqa-tests/TKG/../TKG/output_17388506952171/jdk_net_1"; \
[2025-02-06T14:55:18.136Z] cd "/home/jenkins/workspace/Test_openjdk11_hs_extended.openjdk_s390x_linux_testList_4/aqa-tests/TKG/../TKG/output_17388506952171/jdk_net_1"; \
[2025-02-06T14:55:18.136Z] echo ""; echo "TESTING:"; \
[2025-02-06T14:55:18.136Z] "/home/jenkins/workspace/Test_openjdk11_hs_extended.openjdk_s390x_linux_testList_4/jdkbinary/j2sdk-image/bin/java" -Xmx512m -jar "/home/jenkins/workspace/Test_openjdk11_hs_extended.openjdk_s390x_linux_testList_4/aqa-tests/TKG/../../jvmtest/openjdk/jtreg/lib/jtreg.jar" \
[2025-02-06T14:55:18.136Z] -agentvm -a -ea -esa -v:fail,error,time,nopass -retain:fail,error,*.dmp,javacore.*,heapdump.*,*.trc -ignore:quiet -timeoutFactor:8 -xml:verify -concurrency:1 -nativepath:"/home/jenkins/workspace/Test_openjdk11_hs_extended.openjdk_s390x_linux_testList_4/jdkbinary/openjdk-test-image/jdk/jtreg/native" -vmoptions:"-Xmx512m -XX:-UseCompressedOops " \
[2025-02-06T14:55:18.136Z] -w ""/home/jenkins/workspace/Test_openjdk11_hs_extended.openjdk_s390x_linux_testList_4/aqa-tests/TKG/../TKG/output_17388506952171/jdk_net_1"/work" \
[2025-02-06T14:55:18.136Z] -r ""/home/jenkins/workspace/Test_openjdk11_hs_extended.openjdk_s390x_linux_testList_4/aqa-tests/TKG/../TKG/output_17388506952171/jdk_net_1"/report" \
[2025-02-06T14:55:18.136Z] -jdk:"/home/jenkins/workspace/Test_openjdk11_hs_extended.openjdk_s390x_linux_testList_4/jdkbinary/j2sdk-image" \
[2025-02-06T14:55:18.136Z] -exclude:"/home/jenkins/workspace/Test_openjdk11_hs_extended.openjdk_s390x_linux_testList_4/aqa-tests/TKG/../openjdk/openjdk-jdk/test/jdk/ProblemList.txt" \
[2025-02-06T14:55:18.136Z] -exclude:"/home/jenkins/workspace/Test_openjdk11_hs_extended.openjdk_s390x_linux_testList_4/aqa-tests/TKG/../../jvmtest/openjdk/excludes/ProblemList_openjdk11.txt" \
[2025-02-06T14:55:18.136Z] \
[2025-02-06T14:55:18.136Z] -exclude:"/home/jenkins/workspace/Test_openjdk11_hs_extended.openjdk_s390x_linux_testList_4/aqa-tests/TKG/../openjdk/excludes/vendors/eclipse/ProblemList_openjdk11.txt" \
[2025-02-06T14:55:18.136Z] "/home/jenkins/workspace/Test_openjdk11_hs_extended.openjdk_s390x_linux_testList_4/aqa-tests/TKG/../openjdk/openjdk-jdk/test/jdk:jdk_net"; \
[2025-02-06T14:55:18.136Z] if [ $? -eq 0 ]; then echo "-----------------------------------"; echo "jdk_net_1""_PASSED"; echo "-----------------------------------"; cd /home/jenkins/workspace/Test_openjdk11_hs_extended.openjdk_s390x_linux_testList_4/aqa-tests/TKG/..; else echo "-----------------------------------"; echo "jdk_net_1""_FAILED"; echo "-----------------------------------"; fi; \
[2025-02-06T14:55:18.136Z] echo ""; echo "TEST TEARDOWN:"; \
[2025-02-06T14:55:18.136Z] echo "Nothing to be done for teardown."; \
[2025-02-06T14:55:18.136Z] } 2>&1 | tee -a "/home/jenkins/workspace/Test_openjdk11_hs_extended.openjdk_s390x_linux_testList_4/aqa-tests/TKG/../TKG/output_17388506952171/TestTargetResult";
[2025-02-06T14:55:18.136Z]
[2025-02-06T14:55:18.136Z] TEST SETUP:
[2025-02-06T14:55:18.136Z] Nothing to be done for setup.
[2025-02-06T14:55:18.136Z]
[2025-02-06T14:55:18.136Z] TESTING:
[2025-02-06T14:55:21.602Z] Directory "/home/jenkins/workspace/Test_openjdk11_hs_extended.openjdk_s390x_linux_testList_4/aqa-tests/TKG/../TKG/output_17388506952171/jdk_net_1/work" not found: creating
[2025-02-06T14:55:21.602Z] Directory "/home/jenkins/workspace/Test_openjdk11_hs_extended.openjdk_s390x_linux_testList_4/aqa-tests/TKG/../TKG/output_17388506952171/jdk_net_1/report" not found: creating
[2025-02-06T14:55:37.450Z] XML output with verification to /home/jenkins/workspace/Test_openjdk11_hs_extended.openjdk_s390x_linux_testList_4/aqa-tests/TKG/output_17388506952171/jdk_net_1/work
[2025-02-06T15:05:26.180Z] --------------------------------------------------
[2025-02-06T15:05:26.180Z] TEST: java/net/httpclient/http2/ConnectionReuseTest.java
[2025-02-06T15:05:26.180Z] TEST JDK: /home/jenkins/workspace/Test_openjdk11_hs_extended.openjdk_s390x_linux_testList_4/jdkbinary/j2sdk-image
[2025-02-06T15:05:26.180Z]
[2025-02-06T15:05:26.180Z] ACTION: build -- Passed. Build successful
[2025-02-06T15:05:26.180Z] REASON: User specified action: run build jdk.test.lib.net.SimpleSSLContext HttpServerAdapters ReferenceTracker jdk.test.lib.net.IPSupport
[2025-02-06T15:05:26.180Z] TIME: 0.428 seconds
[2025-02-06T15:05:26.180Z] messages:
[2025-02-06T15:05:26.180Z] command: build jdk.test.lib.net.SimpleSSLContext HttpServerAdapters ReferenceTracker jdk.test.lib.net.IPSupport
[2025-02-06T15:05:26.180Z] reason: User specified action: run build jdk.test.lib.net.SimpleSSLContext HttpServerAdapters ReferenceTracker jdk.test.lib.net.IPSupport
[2025-02-06T15:05:26.180Z] started: Thu Feb 06 15:04:56 UTC 2025
[2025-02-06T15:05:26.180Z] Library ../:
[2025-02-06T15:05:26.180Z] compile: HttpServerAdapters, ReferenceTracker
[2025-02-06T15:05:26.180Z] Library /test/lib:
[2025-02-06T15:05:26.180Z] compile: jdk.test.lib.net.IPSupport
[2025-02-06T15:05:26.180Z] finished: Thu Feb 06 15:04:56 UTC 2025
[2025-02-06T15:05:26.180Z] elapsed time (seconds): 0.428
[2025-02-06T15:05:26.180Z]
[2025-02-06T15:05:26.180Z] ACTION: compile -- Passed. Compilation successful
[2025-02-06T15:05:26.180Z] REASON: .class file out of date or does not exist
[2025-02-06T15:05:26.180Z] TIME: 0.309 seconds
[2025-02-06T15:05:26.180Z] messages:
[2025-02-06T15:05:26.180Z] command: compile /home/jenkins/workspace/Test_openjdk11_hs_extended.openjdk_s390x_linux_testList_4/aqa-tests/openjdk/openjdk-jdk/test/jdk/java/net/httpclient/HttpServerAdapters.java /home/jenkins/workspace/Test_openjdk11_hs_extended.openjdk_s390x_linux_testList_4/aqa-tests/openjdk/openjdk-jdk/test/jdk/java/net/httpclient/ReferenceTracker.java
[2025-02-06T15:05:26.180Z] reason: .class file out of date or does not exist
[2025-02-06T15:05:26.180Z] started: Thu Feb 06 15:04:56 UTC 2025
[2025-02-06T15:05:26.180Z] Additional options from @modules: --add-modules java.net.http,java.logging,java.base --add-exports java.net.http/jdk.internal.net.http.common=ALL-UNNAMED --add-exports java.net.http/jdk.internal.net.http.frame=ALL-UNNAMED --add-exports java.net.http/jdk.internal.net.http.hpack=ALL-UNNAMED --add-exports java.base/sun.net.www.http=ALL-UNNAMED --add-exports java.base/sun.net.www=ALL-UNNAMED --add-exports java.base/sun.net=ALL-UNNAMED
[2025-02-06T15:05:26.180Z] Mode: agentvm
[2025-02-06T15:05:26.180Z] Agent id: 1
[2025-02-06T15:05:26.180Z] finished: Thu Feb 06 15:04:56 UTC 2025
[2025-02-06T15:05:26.180Z] elapsed time (seconds): 0.309
[2025-02-06T15:05:26.180Z] configuration:
[2025-02-06T15:05:26.180Z] Boot Layer (javac runtime environment)
[2025-02-06T15:05:26.180Z] class path: /home/jenkins/workspace/Test_openjdk11_hs_extended.openjdk_s390x_linux_testList_4/jvmtest/openjdk/jtreg/lib/javatest.jar
[2025-02-06T15:05:26.180Z] /home/jenkins/workspace/Test_openjdk11_hs_extended.openjdk_s390x_linux_testList_4/jvmtest/openjdk/jtreg/lib/jtreg.jar
[2025-02-06T15:05:26.180Z] patch: java.base /home/jenkins/workspace/Test_openjdk11_hs_extended.openjdk_s390x_linux_testList_4/aqa-tests/TKG/output_17388506952171/jdk_net_1/work/patches/java.base
[2025-02-06T15:05:26.180Z]
[2025-02-06T15:05:26.180Z] javac compilation environment
[2025-02-06T15:05:26.180Z] add modules: java.net.http java.logging java.base
[2025-02-06T15:05:26.180Z] add exports: java.base/sun.net ALL-UNNAMED
[2025-02-06T15:05:26.180Z] java.base/sun.net.www ALL-UNNAMED
[2025-02-06T15:05:26.180Z] java.base/sun.net.www.http ALL-UNNAMED
[2025-02-06T15:05:26.180Z] java.net.http/jdk.internal.net.http.common ALL-UNNAMED
[2025-02-06T15:05:26.180Z] java.net.http/jdk.internal.net.http.frame ALL-UNNAMED
[2025-02-06T15:05:26.180Z] java.net.http/jdk.internal.net.http.hpack ALL-UNNAMED
[2025-02-06T15:05:26.180Z] source path: /home/jenkins/workspace/Test_openjdk11_hs_extended.openjdk_s390x_linux_testList_4/aqa-tests/openjdk/openjdk-jdk/test/lib
[2025-02-06T15:05:26.180Z] /home/jenkins/workspace/Test_openjdk11_hs_extended.openjdk_s390x_linux_testList_4/aqa-tests/openjdk/openjdk-jdk/test/jdk/java/net/httpclient/http2/server
[2025-02-06T15:05:26.180Z] /home/jenkins/workspace/Test_openjdk11_hs_extended.openjdk_s390x_linux_testList_4/aqa-tests/openjdk/openjdk-jdk/test/jdk/java/net/httpclient
[2025-02-06T15:05:26.180Z] class path: /home/jenkins/workspace/Test_openjdk11_hs_extended.openjdk_s390x_linux_testList_4/aqa-tests/TKG/output_17388506952171/jdk_net_1/work/classes/test/lib
[2025-02-06T15:05:26.180Z] /home/jenkins/workspace/Test_openjdk11_hs_extended.openjdk_s390x_linux_testList_4/aqa-tests/TKG/output_17388506952171/jdk_net_1/work/classes/java/net/httpclient/http2/server
[2025-02-06T15:05:26.180Z] /home/jenkins/workspace/Test_openjdk11_hs_extended.openjdk_s390x_linux_testList_4/aqa-tests/TKG/output_17388506952171/jdk_net_1/work/classes/java/net/httpclient
[2025-02-06T15:05:26.180Z] /home/jenkins/workspace/Test_openjdk11_hs_extended.openjdk_s390x_linux_testList_4/jvmtest/openjdk/jtreg/lib/junit-platform-console-standalone-1.9.2.jar
[2025-02-06T15:05:26.180Z]
[2025-02-06T15:05:26.180Z] rerun:
[2025-02-06T15:05:26.180Z] cd /home/jenkins/workspace/Test_openjdk11_hs_extended.openjdk_s390x_linux_testList_4/aqa-tests/TKG/output_17388506952171/jdk_net_1/work/scratch && \
[2025-02-06T15:05:26.180Z] DBUS_SESSION_BUS_ADDRESS=unix:path=/run/user/1002/bus \
[2025-02-06T15:05:26.180Z] DISPLAY=:0 \
[2025-02-06T15:05:26.180Z] HOME=/home/jenkins \
[2025-02-06T15:05:26.180Z] LANG=C.UTF-8 \
[2025-02-06T15:05:26.180Z] PATH=/bin:/usr/bin:/usr/sbin \
[2025-02-06T15:05:26.181Z] XDG_RUNTIME_DIR=/run/user/1002 \
[2025-02-06T15:05:26.181Z] XDG_SESSION_CLASS=user \
[2025-02-06T15:05:26.181Z] XDG_SESSION_ID=125568 \
[2025-02-06T15:05:26.181Z] XDG_SESSION_TYPE=tty \
[2025-02-06T15:05:26.181Z] /home/jenkins/workspace/Test_openjdk11_hs_extended.openjdk_s390x_linux_testList_4/jdkbinary/j2sdk-image/bin/javac \
[2025-02-06T15:05:26.181Z] -J-ea \
[2025-02-06T15:05:26.181Z] -J-esa \
[2025-02-06T15:05:26.181Z] -J-Xmx512m \
[2025-02-06T15:05:26.181Z] -J-XX:-UseCompressedOops \
[2025-02-06T15:05:26.181Z] -J-Dtest.vm.opts='-ea -esa -Xmx512m -XX:-UseCompressedOops' \
[2025-02-06T15:05:26.181Z] -J-Dtest.tool.vm.opts='-J-ea -J-esa -J-Xmx512m -J-XX:-UseCompressedOops' \
[2025-02-06T15:05:26.181Z] -J-Dtest.compiler.opts= \
[2025-02-06T15:05:26.181Z] -J-Dtest.java.opts= \
[2025-02-06T15:05:26.181Z] -J-Dtest.jdk=/home/jenkins/workspace/Test_openjdk11_hs_extended.openjdk_s390x_linux_testList_4/jdkbinary/j2sdk-image \
[2025-02-06T15:05:26.181Z] -J-Dcompile.jdk=/home/jenkins/workspace/Test_openjdk11_hs_extended.openjdk_s390x_linux_testList_4/jdkbinary/j2sdk-image \
[2025-02-06T15:05:26.181Z] -J-Dtest.timeout.factor=8.0 \
[2025-02-06T15:05:26.181Z] -J-Dtest.nativepath=/home/jenkins/workspace/Test_openjdk11_hs_extended.openjdk_s390x_linux_testList_4/jdkbinary/openjdk-test-image/jdk/jtreg/native \
[2025-02-06T15:05:26.181Z] -J-Dtest.root=/home/jenkins/workspace/Test_openjdk11_hs_extended.openjdk_s390x_linux_testList_4/aqa-tests/openjdk/openjdk-jdk/test/jdk \
[2025-02-06T15:05:26.181Z] -J-Dtest.name=java/net/httpclient/http2/ConnectionReuseTest.java \
[2025-02-06T15:05:26.181Z] -J-Dtest.file=/home/jenkins/workspace/Test_openjdk11_hs_extended.openjdk_s390x_linux_testList_4/aqa-tests/openjdk/openjdk-jdk/test/jdk/java/net/httpclient/http2/ConnectionReuseTest.java \
[2025-02-06T15:05:26.181Z] -J-Dtest.src=/home/jenkins/workspace/Test_openjdk11_hs_extended.openjdk_s390x_linux_testList_4/aqa-tests/openjdk/openjdk-jdk/test/jdk/java/net/httpclient/http2 \
[2025-02-06T15:05:26.181Z] -J-Dtest.src.path=/home/jenkins/workspace/Test_openjdk11_hs_extended.openjdk_s390x_linux_testList_4/aqa-tests/openjdk/openjdk-jdk/test/jdk/java/net/httpclient/http2:/home/jenkins/workspace/Test_openjdk11_hs_extended.openjdk_s390x_linux_testList_4/aqa-tests/openjdk/openjdk-jdk/test/lib:/home/jenkins/workspace/Test_openjdk11_hs_extended.openjdk_s390x_linux_testList_4/aqa-tests/openjdk/openjdk-jdk/test/jdk/java/net/httpclient/http2/server:/home/jenkins/workspace/Test_openjdk11_hs_extended.openjdk_s390x_linux_testList_4/aqa-tests/openjdk/openjdk-jdk/test/jdk/java/net/httpclient \
[2025-02-06T15:05:26.181Z] -J-Dtest.classes=/home/jenkins/workspace/Test_openjdk11_hs_extended.openjdk_s390x_linux_testList_4/aqa-tests/TKG/output_17388506952171/jdk_net_1/work/classes/java/net/httpclient/http2/ConnectionReuseTest.d \
[2025-02-06T15:05:26.181Z] -J-Dtest.class.path=/home/jenkins/workspace/Test_openjdk11_hs_extended.openjdk_s390x_linux_testList_4/aqa-tests/TKG/output_17388506952171/jdk_net_1/work/classes/java/net/httpclient/http2/ConnectionReuseTest.d:/home/jenkins/workspace/Test_openjdk11_hs_extended.openjdk_s390x_linux_testList_4/aqa-tests/TKG/output_17388506952171/jdk_net_1/work/classes/test/lib:/home/jenkins/workspace/Test_openjdk11_hs_extended.openjdk_s390x_linux_testList_4/aqa-tests/TKG/output_17388506952171/jdk_net_1/work/classes/java/net/httpclient/http2/server:/home/jenkins/workspace/Test_openjdk11_hs_extended.openjdk_s390x_linux_testList_4/aqa-tests/TKG/output_17388506952171/jdk_net_1/work/classes/java/net/httpclient \
[2025-02-06T15:05:26.181Z] -J-Dtest.class.path.prefix=/home/jenkins/workspace/Test_openjdk11_hs_extended.openjdk_s390x_linux_testList_4/aqa-tests/openjdk/openjdk-jdk/test/jdk/java/net/httpclient/http2:/home/jenkins/workspace/Test_openjdk11_hs_extended.openjdk_s390x_linux_testList_4/aqa-tests/TKG/output_17388506952171/jdk_net_1/work/classes/test/lib:/home/jenkins/workspace/Test_openjdk11_hs_extended.openjdk_s390x_linux_testList_4/aqa-tests/TKG/output_17388506952171/jdk_net_1/work/classes/java/net/httpclient/http2/server:/home/jenkins/workspace/Test_openjdk11_hs_extended.openjdk_s390x_linux_testList_4/aqa-tests/TKG/output_17388506952171/jdk_net_1/work/classes/java/net/httpclient \
[2025-02-06T15:05:26.181Z] -J-Dtest.modules='java.net.http/jdk.internal.net.http.common java.net.http/jdk.internal.net.http.frame java.net.http/jdk.internal.net.http.hpack java.logging java.base/sun.net.www.http java.base/sun.net.www java.base/sun.net' \
[2025-02-06T15:05:26.181Z] --add-modules java.net.http,java.logging,java.base \
[2025-02-06T15:05:26.181Z] --add-exports java.net.http/jdk.internal.net.http.common=ALL-UNNAMED \
[2025-02-06T15:05:26.181Z] --add-exports java.net.http/jdk.internal.net.http.frame=ALL-UNNAMED \
[2025-02-06T15:05:26.181Z] --add-exports java.net.http/jdk.internal.net.http.hpack=ALL-UNNAMED \
[2025-02-06T15:05:26.181Z] --add-exports java.base/sun.net.www.http=ALL-UNNAMED \
[2025-02-06T15:05:26.181Z] --add-exports java.base/sun.net.www=ALL-UNNAMED \
[2025-02-06T15:05:26.181Z] --add-exports java.base/sun.net=ALL-UNNAMED \
[2025-02-06T15:05:26.181Z] -d /home/jenkins/workspace/Test_openjdk11_hs_extended.openjdk_s390x_linux_testList_4/aqa-tests/TKG/output_17388506952171/jdk_net_1/work/classes/java/net/httpclient \
[2025-02-06T15:05:26.181Z] -sourcepath /home/jenkins/workspace/Test_openjdk11_hs_extended.openjdk_s390x_linux_testList_4/aqa-tests/openjdk/openjdk-jdk/test/lib:/home/jenkins/workspace/Test_openjdk11_hs_extended.openjdk_s390x_linux_testList_4/aqa-tests/openjdk/openjdk-jdk/test/jdk/java/net/httpclient/http2/server:/home/jenkins/workspace/Test_openjdk11_hs_extended.openjdk_s390x_linux_testList_4/aqa-tests/openjdk/openjdk-jdk/test/jdk/java/net/httpclient \
[2025-02-06T15:05:26.181Z] -classpath /home/jenkins/workspace/Test_openjdk11_hs_extended.openjdk_s390x_linux_testList_4/aqa-tests/TKG/output_17388506952171/jdk_net_1/work/classes/test/lib:/home/jenkins/workspace/Test_openjdk11_hs_extended.openjdk_s390x_linux_testList_4/aqa-tests/TKG/output_17388506952171/jdk_net_1/work/classes/java/net/httpclient/http2/server:/home/jenkins/workspace/Test_openjdk11_hs_extended.openjdk_s390x_linux_testList_4/aqa-tests/TKG/output_17388506952171/jdk_net_1/work/classes/java/net/httpclient:/home/jenkins/workspace/Test_openjdk11_hs_extended.openjdk_s390x_linux_testList_4/jvmtest/openjdk/jtreg/lib/junit-platform-console-standalone-1.9.2.jar /home/jenkins/workspace/Test_openjdk11_hs_extended.openjdk_s390x_linux_testList_4/aqa-tests/openjdk/openjdk-jdk/test/jdk/java/net/httpclient/HttpServerAdapters.java /home/jenkins/workspace/Test_openjdk11_hs_extended.openjdk_s390x_linux_testList_4/aqa-tests/openjdk/openjdk-jdk/test/jdk/java/net/httpclient/ReferenceTracker.java
[2025-02-06T15:05:26.181Z]
[2025-02-06T15:05:26.181Z] ACTION: compile -- Passed. Compilation successful
[2025-02-06T15:05:26.181Z] REASON: .class file out of date or does not exist
[2025-02-06T15:05:26.181Z] TIME: 0.118 seconds
[2025-02-06T15:05:26.181Z] messages:
[2025-02-06T15:05:26.181Z] command: compile /home/jenkins/workspace/Test_openjdk11_hs_extended.openjdk_s390x_linux_testList_4/aqa-tests/openjdk/openjdk-jdk/test/lib/jdk/test/lib/net/IPSupport.java
[2025-02-06T15:05:26.181Z] reason: .class file out of date or does not exist
[2025-02-06T15:05:26.181Z] started: Thu Feb 06 15:04:56 UTC 2025
[2025-02-06T15:05:26.181Z] Additional options from @modules: --add-modules java.net.http,java.logging,java.base --add-exports java.net.http/jdk.internal.net.http.common=ALL-UNNAMED --add-exports java.net.http/jdk.internal.net.http.frame=ALL-UNNAMED --add-exports java.net.http/jdk.internal.net.http.hpack=ALL-UNNAMED --add-exports java.base/sun.net.www.http=ALL-UNNAMED --add-exports java.base/sun.net.www=ALL-UNNAMED --add-exports java.base/sun.net=ALL-UNNAMED
[2025-02-06T15:05:26.181Z] Mode: agentvm
[2025-02-06T15:05:26.181Z] Agent id: 1
[2025-02-06T15:05:26.181Z] finished: Thu Feb 06 15:04:56 UTC 2025
[2025-02-06T15:05:26.181Z] elapsed time (seconds): 0.118
[2025-02-06T15:05:26.181Z] configuration:
[2025-02-06T15:05:26.181Z] Boot Layer (javac runtime environment)
[2025-02-06T15:05:26.181Z] class path: /home/jenkins/workspace/Test_openjdk11_hs_extended.openjdk_s390x_linux_testList_4/jvmtest/openjdk/jtreg/lib/javatest.jar
[2025-02-06T15:05:26.181Z] /home/jenkins/workspace/Test_openjdk11_hs_extended.openjdk_s390x_linux_testList_4/jvmtest/openjdk/jtreg/lib/jtreg.jar
[2025-02-06T15:05:26.181Z] patch: java.base /home/jenkins/workspace/Test_openjdk11_hs_extended.openjdk_s390x_linux_testList_4/aqa-tests/TKG/output_17388506952171/jdk_net_1/work/patches/java.base
[2025-02-06T15:05:26.181Z]
[2025-02-06T15:05:26.181Z] javac compilation environment
[2025-02-06T15:05:26.181Z] add modules: java.net.http java.logging java.base
[2025-02-06T15:05:26.181Z] add exports: java.base/sun.net ALL-UNNAMED
[2025-02-06T15:05:26.181Z] java.base/sun.net.www ALL-UNNAMED
[2025-02-06T15:05:26.181Z] java.base/sun.net.www.http ALL-UNNAMED
[2025-02-06T15:05:26.181Z] java.net.http/jdk.internal.net.http.common ALL-UNNAMED
[2025-02-06T15:05:26.181Z] java.net.http/jdk.internal.net.http.frame ALL-UNNAMED
[2025-02-06T15:05:26.181Z] java.net.http/jdk.internal.net.http.hpack ALL-UNNAMED
[2025-02-06T15:05:26.181Z] source path: /home/jenkins/workspace/Test_openjdk11_hs_extended.openjdk_s390x_linux_testList_4/aqa-tests/openjdk/openjdk-jdk/test/lib
[2025-02-06T15:05:26.181Z] /home/jenkins/workspace/Test_openjdk11_hs_extended.openjdk_s390x_linux_testList_4/aqa-tests/openjdk/openjdk-jdk/test/jdk/java/net/httpclient/http2/server
[2025-02-06T15:05:26.181Z] /home/jenkins/workspace/Test_openjdk11_hs_extended.openjdk_s390x_linux_testList_4/aqa-tests/openjdk/openjdk-jdk/test/jdk/java/net/httpclient
[2025-02-06T15:05:26.181Z] class path: /home/jenkins/workspace/Test_openjdk11_hs_extended.openjdk_s390x_linux_testList_4/aqa-tests/TKG/output_17388506952171/jdk_net_1/work/classes/test/lib
[2025-02-06T15:05:26.181Z] /home/jenkins/workspace/Test_openjdk11_hs_extended.openjdk_s390x_linux_testList_4/aqa-tests/TKG/output_17388506952171/jdk_net_1/work/classes/java/net/httpclient/http2/server
[2025-02-06T15:05:26.181Z] /home/jenkins/workspace/Test_openjdk11_hs_extended.openjdk_s390x_linux_testList_4/aqa-tests/TKG/output_17388506952171/jdk_net_1/work/classes/java/net/httpclient
[2025-02-06T15:05:26.181Z] /home/jenkins/workspace/Test_openjdk11_hs_extended.openjdk_s390x_linux_testList_4/jvmtest/openjdk/jtreg/lib/junit-platform-console-standalone-1.9.2.jar
[2025-02-06T15:05:26.181Z]
[2025-02-06T15:05:26.181Z] rerun:
[2025-02-06T15:05:26.181Z] cd /home/jenkins/workspace/Test_openjdk11_hs_extended.openjdk_s390x_linux_testList_4/aqa-tests/TKG/output_17388506952171/jdk_net_1/work/scratch && \
[2025-02-06T15:05:26.181Z] DBUS_SESSION_BUS_ADDRESS=unix:path=/run/user/1002/bus \
[2025-02-06T15:05:26.181Z] DISPLAY=:0 \
[2025-02-06T15:05:26.181Z] HOME=/home/jenkins \
[2025-02-06T15:05:26.181Z] LANG=C.UTF-8 \
[2025-02-06T15:05:26.181Z] PATH=/bin:/usr/bin:/usr/sbin \
[2025-02-06T15:05:26.181Z] XDG_RUNTIME_DIR=/run/user/1002 \
[2025-02-06T15:05:26.181Z] XDG_SESSION_CLASS=user \
[2025-02-06T15:05:26.181Z] XDG_SESSION_ID=125568 \
[2025-02-06T15:05:26.181Z] XDG_SESSION_TYPE=tty \
[2025-02-06T15:05:26.181Z] /home/jenkins/workspace/Test_openjdk11_hs_extended.openjdk_s390x_linux_testList_4/jdkbinary/j2sdk-image/bin/javac \
[2025-02-06T15:05:26.181Z] -J-ea \
[2025-02-06T15:05:26.181Z] -J-esa \
[2025-02-06T15:05:26.181Z] -J-Xmx512m \
[2025-02-06T15:05:26.181Z] -J-XX:-UseCompressedOops \
[2025-02-06T15:05:26.181Z] -J-Dtest.vm.opts='-ea -esa -Xmx512m -XX:-UseCompressedOops' \
[2025-02-06T15:05:26.181Z] -J-Dtest.tool.vm.opts='-J-ea -J-esa -J-Xmx512m -J-XX:-UseCompressedOops' \
[2025-02-06T15:05:26.181Z] -J-Dtest.compiler.opts= \
[2025-02-06T15:05:26.181Z] -J-Dtest.java.opts= \
[2025-02-06T15:05:26.181Z] -J-Dtest.jdk=/home/jenkins/workspace/Test_openjdk11_hs_extended.openjdk_s390x_linux_testList_4/jdkbinary/j2sdk-image \
[2025-02-06T15:05:26.181Z] -J-Dcompile.jdk=/home/jenkins/workspace/Test_openjdk11_hs_extended.openjdk_s390x_linux_testList_4/jdkbinary/j2sdk-image \
[2025-02-06T15:05:26.181Z] -J-Dtest.timeout.factor=8.0 \
[2025-02-06T15:05:26.181Z] -J-Dtest.nativepath=/home/jenkins/workspace/Test_openjdk11_hs_extended.openjdk_s390x_linux_testList_4/jdkbinary/openjdk-test-image/jdk/jtreg/native \
[2025-02-06T15:05:26.181Z] -J-Dtest.root=/home/jenkins/workspace/Test_openjdk11_hs_extended.openjdk_s390x_linux_testList_4/aqa-tests/openjdk/openjdk-jdk/test/jdk \
[2025-02-06T15:05:26.181Z] -J-Dtest.name=java/net/httpclient/http2/ConnectionReuseTest.java \
[2025-02-06T15:05:26.181Z] -J-Dtest.file=/home/jenkins/workspace/Test_openjdk11_hs_extended.openjdk_s390x_linux_testList_4/aqa-tests/openjdk/openjdk-jdk/test/jdk/java/net/httpclient/http2/ConnectionReuseTest.java \
[2025-02-06T15:05:26.181Z] -J-Dtest.src=/home/jenkins/workspace/Test_openjdk11_hs_extended.openjdk_s390x_linux_testList_4/aqa-tests/openjdk/openjdk-jdk/test/jdk/java/net/httpclient/http2 \
[2025-02-06T15:05:26.181Z] -J-Dtest.src.path=/home/jenkins/workspace/Test_openjdk11_hs_extended.openjdk_s390x_linux_testList_4/aqa-tests/openjdk/openjdk-jdk/test/jdk/java/net/httpclient/http2:/home/jenkins/workspace/Test_openjdk11_hs_extended.openjdk_s390x_linux_testList_4/aqa-tests/openjdk/openjdk-jdk/test/lib:/home/jenkins/workspace/Test_openjdk11_hs_extended.openjdk_s390x_linux_testList_4/aqa-tests/openjdk/openjdk-jdk/test/jdk/java/net/httpclient/http2/server:/home/jenkins/workspace/Test_openjdk11_hs_extended.openjdk_s390x_linux_testList_4/aqa-tests/openjdk/openjdk-jdk/test/jdk/java/net/httpclient \
[2025-02-06T15:05:26.181Z] -J-Dtest.classes=/home/jenkins/workspace/Test_openjdk11_hs_extended.openjdk_s390x_linux_testList_4/aqa-tests/TKG/output_17388506952171/jdk_net_1/work/classes/java/net/httpclient/http2/ConnectionReuseTest.d \
[2025-02-06T15:05:26.181Z] -J-Dtest.class.path=/home/jenkins/workspace/Test_openjdk11_hs_extended.openjdk_s390x_linux_testList_4/aqa-tests/TKG/output_17388506952171/jdk_net_1/work/classes/java/net/httpclient/http2/ConnectionReuseTest.d:/home/jenkins/workspace/Test_openjdk11_hs_extended.openjdk_s390x_linux_testList_4/aqa-tests/TKG/output_17388506952171/jdk_net_1/work/classes/test/lib:/home/jenkins/workspace/Test_openjdk11_hs_extended.openjdk_s390x_linux_testList_4/aqa-tests/TKG/output_17388506952171/jdk_net_1/work/classes/java/net/httpclient/http2/server:/home/jenkins/workspace/Test_openjdk11_hs_extended.openjdk_s390x_linux_testList_4/aqa-tests/TKG/output_17388506952171/jdk_net_1/work/classes/java/net/httpclient \
[2025-02-06T15:05:26.181Z] -J-Dtest.class.path.prefix=/home/jenkins/workspace/Test_openjdk11_hs_extended.openjdk_s390x_linux_testList_4/aqa-tests/openjdk/openjdk-jdk/test/jdk/java/net/httpclient/http2:/home/jenkins/workspace/Test_openjdk11_hs_extended.openjdk_s390x_linux_testList_4/aqa-tests/TKG/output_17388506952171/jdk_net_1/work/classes/test/lib:/home/jenkins/workspace/Test_openjdk11_hs_extended.openjdk_s390x_linux_testList_4/aqa-tests/TKG/output_17388506952171/jdk_net_1/work/classes/java/net/httpclient/http2/server:/home/jenkins/workspace/Test_openjdk11_hs_extended.openjdk_s390x_linux_testList_4/aqa-tests/TKG/output_17388506952171/jdk_net_1/work/classes/java/net/httpclient \
[2025-02-06T15:05:26.181Z] -J-Dtest.modules='java.net.http/jdk.internal.net.http.common java.net.http/jdk.internal.net.http.frame java.net.http/jdk.internal.net.http.hpack java.logging java.base/sun.net.www.http java.base/sun.net.www java.base/sun.net' \
[2025-02-06T15:05:26.181Z] --add-modules java.net.http,java.logging,java.base \
[2025-02-06T15:05:26.181Z] --add-exports java.net.http/jdk.internal.net.http.common=ALL-UNNAMED \
[2025-02-06T15:05:26.181Z] --add-exports java.net.http/jdk.internal.net.http.frame=ALL-UNNAMED \
[2025-02-06T15:05:26.181Z] --add-exports java.net.http/jdk.internal.net.http.hpack=ALL-UNNAMED \
[2025-02-06T15:05:26.181Z] --add-exports java.base/sun.net.www.http=ALL-UNNAMED \
[2025-02-06T15:05:26.181Z] --add-exports java.base/sun.net.www=ALL-UNNAMED \
[2025-02-06T15:05:26.181Z] --add-exports java.base/sun.net=ALL-UNNAMED \
[2025-02-06T15:05:26.181Z] -d /home/jenkins/workspace/Test_openjdk11_hs_extended.openjdk_s390x_linux_testList_4/aqa-tests/TKG/output_17388506952171/jdk_net_1/work/classes/test/lib \
[2025-02-06T15:05:26.181Z] -sourcepath /home/jenkins/workspace/Test_openjdk11_hs_extended.openjdk_s390x_linux_testList_4/aqa-tests/openjdk/openjdk-jdk/test/lib:/home/jenkins/workspace/Test_openjdk11_hs_extended.openjdk_s390x_linux_testList_4/aqa-tests/openjdk/openjdk-jdk/test/jdk/java/net/httpclient/http2/server:/home/jenkins/workspace/Test_openjdk11_hs_extended.openjdk_s390x_linux_testList_4/aqa-tests/openjdk/openjdk-jdk/test/jdk/java/net/httpclient \
[2025-02-06T15:05:26.181Z] -classpath /home/jenkins/workspace/Test_openjdk11_hs_extended.openjdk_s390x_linux_testList_4/aqa-tests/TKG/output_17388506952171/jdk_net_1/work/classes/test/lib:/home/jenkins/workspace/Test_openjdk11_hs_extended.openjdk_s390x_linux_testList_4/aqa-tests/TKG/output_17388506952171/jdk_net_1/work/classes/java/net/httpclient/http2/server:/home/jenkins/workspace/Test_openjdk11_hs_extended.openjdk_s390x_linux_testList_4/aqa-tests/TKG/output_17388506952171/jdk_net_1/work/classes/java/net/httpclient:/home/jenkins/workspace/Test_openjdk11_hs_extended.openjdk_s390x_linux_testList_4/jvmtest/openjdk/jtreg/lib/junit-platform-console-standalone-1.9.2.jar /home/jenkins/workspace/Test_openjdk11_hs_extended.openjdk_s390x_linux_testList_4/aqa-tests/openjdk/openjdk-jdk/test/lib/jdk/test/lib/net/IPSupport.java
[2025-02-06T15:05:26.181Z]
[2025-02-06T15:05:26.181Z] ACTION: build -- Passed. Build successful
[2025-02-06T15:05:26.181Z] REASON: Named class compiled on demand
[2025-02-06T15:05:26.181Z] TIME: 0.142 seconds
[2025-02-06T15:05:26.181Z] messages:
[2025-02-06T15:05:26.181Z] command: build ConnectionReuseTest
[2025-02-06T15:05:26.181Z] reason: Named class compiled on demand
[2025-02-06T15:05:26.181Z] started: Thu Feb 06 15:04:56 UTC 2025
[2025-02-06T15:05:26.181Z] Test directory:
[2025-02-06T15:05:26.181Z] compile: ConnectionReuseTest
[2025-02-06T15:05:26.181Z] finished: Thu Feb 06 15:04:56 UTC 2025
[2025-02-06T15:05:26.181Z] elapsed time (seconds): 0.142
[2025-02-06T15:05:26.181Z]
[2025-02-06T15:05:26.181Z] ACTION: compile -- Passed. Compilation successful
[2025-02-06T15:05:26.181Z] REASON: .class file out of date or does not exist
[2025-02-06T15:05:26.181Z] TIME: 0.14 seconds
[2025-02-06T15:05:26.181Z] messages:
[2025-02-06T15:05:26.181Z] command: compile /home/jenkins/workspace/Test_openjdk11_hs_extended.openjdk_s390x_linux_testList_4/aqa-tests/openjdk/openjdk-jdk/test/jdk/java/net/httpclient/http2/ConnectionReuseTest.java
[2025-02-06T15:05:26.181Z] reason: .class file out of date or does not exist
[2025-02-06T15:05:26.181Z] started: Thu Feb 06 15:04:56 UTC 2025
[2025-02-06T15:05:26.181Z] Additional options from @modules: --add-modules java.net.http,java.logging,java.base --add-exports java.net.http/jdk.internal.net.http.common=ALL-UNNAMED --add-exports java.net.http/jdk.internal.net.http.frame=ALL-UNNAMED --add-exports java.net.http/jdk.internal.net.http.hpack=ALL-UNNAMED --add-exports java.base/sun.net.www.http=ALL-UNNAMED --add-exports java.base/sun.net.www=ALL-UNNAMED --add-exports java.base/sun.net=ALL-UNNAMED
[2025-02-06T15:05:26.181Z] Mode: agentvm
[2025-02-06T15:05:26.181Z] Agent id: 1
[2025-02-06T15:05:26.181Z] finished: Thu Feb 06 15:04:56 UTC 2025
[2025-02-06T15:05:26.181Z] elapsed time (seconds): 0.14
[2025-02-06T15:05:26.181Z] configuration:
[2025-02-06T15:05:26.181Z] Boot Layer (javac runtime environment)
[2025-02-06T15:05:26.181Z] class path: /home/jenkins/workspace/Test_openjdk11_hs_extended.openjdk_s390x_linux_testList_4/jvmtest/openjdk/jtreg/lib/javatest.jar
[2025-02-06T15:05:26.181Z] /home/jenkins/workspace/Test_openjdk11_hs_extended.openjdk_s390x_linux_testList_4/jvmtest/openjdk/jtreg/lib/jtreg.jar
[2025-02-06T15:05:26.182Z] patch: java.base /home/jenkins/workspace/Test_openjdk11_hs_extended.openjdk_s390x_linux_testList_4/aqa-tests/TKG/output_17388506952171/jdk_net_1/work/patches/java.base
[2025-02-06T15:05:26.182Z]
[2025-02-06T15:05:26.182Z] javac compilation environment
[2025-02-06T15:05:26.182Z] add modules: java.net.http java.logging java.base
[2025-02-06T15:05:26.182Z] add exports: java.base/sun.net ALL-UNNAMED
[2025-02-06T15:05:26.182Z] java.base/sun.net.www ALL-UNNAMED
[2025-02-06T15:05:26.182Z] java.base/sun.net.www.http ALL-UNNAMED
[2025-02-06T15:05:26.182Z] java.net.http/jdk.internal.net.http.common ALL-UNNAMED
[2025-02-06T15:05:26.182Z] java.net.http/jdk.internal.net.http.frame ALL-UNNAMED
[2025-02-06T15:05:26.182Z] java.net.http/jdk.internal.net.http.hpack ALL-UNNAMED
[2025-02-06T15:05:26.182Z] source path: /home/jenkins/workspace/Test_openjdk11_hs_extended.openjdk_s390x_linux_testList_4/aqa-tests/openjdk/openjdk-jdk/test/jdk/java/net/httpclient/http2
[2025-02-06T15:05:26.182Z] /home/jenkins/workspace/Test_openjdk11_hs_extended.openjdk_s390x_linux_testList_4/aqa-tests/openjdk/openjdk-jdk/test/lib
[2025-02-06T15:05:26.182Z] /home/jenkins/workspace/Test_openjdk11_hs_extended.openjdk_s390x_linux_testList_4/aqa-tests/openjdk/openjdk-jdk/test/jdk/java/net/httpclient/http2/server
[2025-02-06T15:05:26.182Z] /home/jenkins/workspace/Test_openjdk11_hs_extended.openjdk_s390x_linux_testList_4/aqa-tests/openjdk/openjdk-jdk/test/jdk/java/net/httpclient
[2025-02-06T15:05:26.182Z] class path: /home/jenkins/workspace/Test_openjdk11_hs_extended.openjdk_s390x_linux_testList_4/aqa-tests/openjdk/openjdk-jdk/test/jdk/java/net/httpclient/http2
[2025-02-06T15:05:26.182Z] /home/jenkins/workspace/Test_openjdk11_hs_extended.openjdk_s390x_linux_testList_4/aqa-tests/TKG/output_17388506952171/jdk_net_1/work/classes/java/net/httpclient/http2/ConnectionReuseTest.d
[2025-02-06T15:05:26.182Z] /home/jenkins/workspace/Test_openjdk11_hs_extended.openjdk_s390x_linux_testList_4/aqa-tests/TKG/output_17388506952171/jdk_net_1/work/classes/test/lib
[2025-02-06T15:05:26.182Z] /home/jenkins/workspace/Test_openjdk11_hs_extended.openjdk_s390x_linux_testList_4/aqa-tests/TKG/output_17388506952171/jdk_net_1/work/classes/java/net/httpclient/http2/server
[2025-02-06T15:05:26.182Z] /home/jenkins/workspace/Test_openjdk11_hs_extended.openjdk_s390x_linux_testList_4/aqa-tests/TKG/output_17388506952171/jdk_net_1/work/classes/java/net/httpclient
[2025-02-06T15:05:26.182Z] /home/jenkins/workspace/Test_openjdk11_hs_extended.openjdk_s390x_linux_testList_4/jvmtest/openjdk/jtreg/lib/junit-platform-console-standalone-1.9.2.jar
[2025-02-06T15:05:26.182Z]
[2025-02-06T15:05:26.182Z] rerun:
[2025-02-06T15:05:26.182Z] cd /home/jenkins/workspace/Test_openjdk11_hs_extended.openjdk_s390x_linux_testList_4/aqa-tests/TKG/output_17388506952171/jdk_net_1/work/scratch && \
[2025-02-06T15:05:26.182Z] DBUS_SESSION_BUS_ADDRESS=unix:path=/run/user/1002/bus \
[2025-02-06T15:05:26.182Z] DISPLAY=:0 \
[2025-02-06T15:05:26.182Z] HOME=/home/jenkins \
[2025-02-06T15:05:26.182Z] LANG=C.UTF-8 \
[2025-02-06T15:05:26.182Z] PATH=/bin:/usr/bin:/usr/sbin \
[2025-02-06T15:05:26.182Z] XDG_RUNTIME_DIR=/run/user/1002 \
[2025-02-06T15:05:26.182Z] XDG_SESSION_CLASS=user \
[2025-02-06T15:05:26.182Z] XDG_SESSION_ID=125568 \
[2025-02-06T15:05:26.182Z] XDG_SESSION_TYPE=tty \
[2025-02-06T15:05:26.182Z] /home/jenkins/workspace/Test_openjdk11_hs_extended.openjdk_s390x_linux_testList_4/jdkbinary/j2sdk-image/bin/javac \
[2025-02-06T15:05:26.182Z] -J-ea \
[2025-02-06T15:05:26.182Z] -J-esa \
[2025-02-06T15:05:26.182Z] -J-Xmx512m \
[2025-02-06T15:05:26.182Z] -J-XX:-UseCompressedOops \
[2025-02-06T15:05:26.182Z] -J-Dtest.vm.opts='-ea -esa -Xmx512m -XX:-UseCompressedOops' \
[2025-02-06T15:05:26.182Z] -J-Dtest.tool.vm.opts='-J-ea -J-esa -J-Xmx512m -J-XX:-UseCompressedOops' \
[2025-02-06T15:05:26.182Z] -J-Dtest.compiler.opts= \
[2025-02-06T15:05:26.182Z] -J-Dtest.java.opts= \
[2025-02-06T15:05:26.182Z] -J-Dtest.jdk=/home/jenkins/workspace/Test_openjdk11_hs_extended.openjdk_s390x_linux_testList_4/jdkbinary/j2sdk-image \
[2025-02-06T15:05:26.182Z] -J-Dcompile.jdk=/home/jenkins/workspace/Test_openjdk11_hs_extended.openjdk_s390x_linux_testList_4/jdkbinary/j2sdk-image \
[2025-02-06T15:05:26.182Z] -J-Dtest.timeout.factor=8.0 \
[2025-02-06T15:05:26.182Z] -J-Dtest.nativepath=/home/jenkins/workspace/Test_openjdk11_hs_extended.openjdk_s390x_linux_testList_4/jdkbinary/openjdk-test-image/jdk/jtreg/native \
[2025-02-06T15:05:26.182Z] -J-Dtest.root=/home/jenkins/workspace/Test_openjdk11_hs_extended.openjdk_s390x_linux_testList_4/aqa-tests/openjdk/openjdk-jdk/test/jdk \
[2025-02-06T15:05:26.182Z] -J-Dtest.name=java/net/httpclient/http2/ConnectionReuseTest.java \
[2025-02-06T15:05:26.182Z] -J-Dtest.file=/home/jenkins/workspace/Test_openjdk11_hs_extended.openjdk_s390x_linux_testList_4/aqa-tests/openjdk/openjdk-jdk/test/jdk/java/net/httpclient/http2/ConnectionReuseTest.java \
[2025-02-06T15:05:26.182Z] -J-Dtest.src=/home/jenkins/workspace/Test_openjdk11_hs_extended.openjdk_s390x_linux_testList_4/aqa-tests/openjdk/openjdk-jdk/test/jdk/java/net/httpclient/http2 \
[2025-02-06T15:05:26.182Z] -J-Dtest.src.path=/home/jenkins/workspace/Test_openjdk11_hs_extended.openjdk_s390x_linux_testList_4/aqa-tests/openjdk/openjdk-jdk/test/jdk/java/net/httpclient/http2:/home/jenkins/workspace/Test_openjdk11_hs_extended.openjdk_s390x_linux_testList_4/aqa-tests/openjdk/openjdk-jdk/test/lib:/home/jenkins/workspace/Test_openjdk11_hs_extended.openjdk_s390x_linux_testList_4/aqa-tests/openjdk/openjdk-jdk/test/jdk/java/net/httpclient/http2/server:/home/jenkins/workspace/Test_openjdk11_hs_extended.openjdk_s390x_linux_testList_4/aqa-tests/openjdk/openjdk-jdk/test/jdk/java/net/httpclient \
[2025-02-06T15:05:26.182Z] -J-Dtest.classes=/home/jenkins/workspace/Test_openjdk11_hs_extended.openjdk_s390x_linux_testList_4/aqa-tests/TKG/output_17388506952171/jdk_net_1/work/classes/java/net/httpclient/http2/ConnectionReuseTest.d \
[2025-02-06T15:05:26.182Z] -J-Dtest.class.path=/home/jenkins/workspace/Test_openjdk11_hs_extended.openjdk_s390x_linux_testList_4/aqa-tests/TKG/output_17388506952171/jdk_net_1/work/classes/java/net/httpclient/http2/ConnectionReuseTest.d:/home/jenkins/workspace/Test_openjdk11_hs_extended.openjdk_s390x_linux_testList_4/aqa-tests/TKG/output_17388506952171/jdk_net_1/work/classes/test/lib:/home/jenkins/workspace/Test_openjdk11_hs_extended.openjdk_s390x_linux_testList_4/aqa-tests/TKG/output_17388506952171/jdk_net_1/work/classes/java/net/httpclient/http2/server:/home/jenkins/workspace/Test_openjdk11_hs_extended.openjdk_s390x_linux_testList_4/aqa-tests/TKG/output_17388506952171/jdk_net_1/work/classes/java/net/httpclient \
[2025-02-06T15:05:26.182Z] -J-Dtest.class.path.prefix=/home/jenkins/workspace/Test_openjdk11_hs_extended.openjdk_s390x_linux_testList_4/aqa-tests/TKG/output_17388506952171/jdk_net_1/work/classes/java/net/httpclient/http2/ConnectionReuseTest.d:/home/jenkins/workspace/Test_openjdk11_hs_extended.openjdk_s390x_linux_testList_4/aqa-tests/openjdk/openjdk-jdk/test/jdk/java/net/httpclient/http2:/home/jenkins/workspace/Test_openjdk11_hs_extended.openjdk_s390x_linux_testList_4/aqa-tests/TKG/output_17388506952171/jdk_net_1/work/classes/test/lib:/home/jenkins/workspace/Test_openjdk11_hs_extended.openjdk_s390x_linux_testList_4/aqa-tests/TKG/output_17388506952171/jdk_net_1/work/classes/java/net/httpclient/http2/server:/home/jenkins/workspace/Test_openjdk11_hs_extended.openjdk_s390x_linux_testList_4/aqa-tests/TKG/output_17388506952171/jdk_net_1/work/classes/java/net/httpclient \
[2025-02-06T15:05:26.182Z] -J-Dtest.modules='java.net.http/jdk.internal.net.http.common java.net.http/jdk.internal.net.http.frame java.net.http/jdk.internal.net.http.hpack java.logging java.base/sun.net.www.http java.base/sun.net.www java.base/sun.net' \
[2025-02-06T15:05:26.182Z] --add-modules java.net.http,java.logging,java.base \
[2025-02-06T15:05:26.182Z] --add-exports java.net.http/jdk.internal.net.http.common=ALL-UNNAMED \
[2025-02-06T15:05:26.182Z] --add-exports java.net.http/jdk.internal.net.http.frame=ALL-UNNAMED \
[2025-02-06T15:05:26.182Z] --add-exports java.net.http/jdk.internal.net.http.hpack=ALL-UNNAMED \
[2025-02-06T15:05:26.182Z] --add-exports java.base/sun.net.www.http=ALL-UNNAMED \
[2025-02-06T15:05:26.182Z] --add-exports java.base/sun.net.www=ALL-UNNAMED \
[2025-02-06T15:05:26.182Z] --add-exports java.base/sun.net=ALL-UNNAMED \
[2025-02-06T15:05:26.182Z] -d /home/jenkins/workspace/Test_openjdk11_hs_extended.openjdk_s390x_linux_testList_4/aqa-tests/TKG/output_17388506952171/jdk_net_1/work/classes/java/net/httpclient/http2/ConnectionReuseTest.d \
[2025-02-06T15:05:26.182Z] -sourcepath /home/jenkins/workspace/Test_openjdk11_hs_extended.openjdk_s390x_linux_testList_4/aqa-tests/openjdk/openjdk-jdk/test/jdk/java/net/httpclient/http2:/home/jenkins/workspace/Test_openjdk11_hs_extended.openjdk_s390x_linux_testList_4/aqa-tests/openjdk/openjdk-jdk/test/lib:/home/jenkins/workspace/Test_openjdk11_hs_extended.openjdk_s390x_linux_testList_4/aqa-tests/openjdk/openjdk-jdk/test/jdk/java/net/httpclient/http2/server:/home/jenkins/workspace/Test_openjdk11_hs_extended.openjdk_s390x_linux_testList_4/aqa-tests/openjdk/openjdk-jdk/test/jdk/java/net/httpclient \
[2025-02-06T15:05:26.182Z] -classpath /home/jenkins/workspace/Test_openjdk11_hs_extended.openjdk_s390x_linux_testList_4/aqa-tests/openjdk/openjdk-jdk/test/jdk/java/net/httpclient/http2:/home/jenkins/workspace/Test_openjdk11_hs_extended.openjdk_s390x_linux_testList_4/aqa-tests/TKG/output_17388506952171/jdk_net_1/work/classes/java/net/httpclient/http2/ConnectionReuseTest.d:/home/jenkins/workspace/Test_openjdk11_hs_extended.openjdk_s390x_linux_testList_4/aqa-tests/TKG/output_17388506952171/jdk_net_1/work/classes/test/lib:/home/jenkins/workspace/Test_openjdk11_hs_extended.openjdk_s390x_linux_testList_4/aqa-tests/TKG/output_17388506952171/jdk_net_1/work/classes/java/net/httpclient/http2/server:/home/jenkins/workspace/Test_openjdk11_hs_extended.openjdk_s390x_linux_testList_4/aqa-tests/TKG/output_17388506952171/jdk_net_1/work/classes/java/net/httpclient:/home/jenkins/workspace/Test_openjdk11_hs_extended.openjdk_s390x_linux_testList_4/jvmtest/openjdk/jtreg/lib/junit-platform-console-standalone-1.9.2.jar /home/jenkins/workspace/Test_openjdk11_hs_extended.openjdk_s390x_linux_testList_4/aqa-tests/openjdk/openjdk-jdk/test/jdk/java/net/httpclient/http2/ConnectionReuseTest.java
[2025-02-06T15:05:26.182Z]
[2025-02-06T15:05:26.182Z] ACTION: junit -- Passed. Execution successful
[2025-02-06T15:05:26.182Z] REASON: User specified action: run junit/othervm ConnectionReuseTest
[2025-02-06T15:05:26.182Z] TIME: 10.518 seconds
[2025-02-06T15:05:26.182Z] messages:
[2025-02-06T15:05:26.182Z] command: junit ConnectionReuseTest
[2025-02-06T15:05:26.182Z] reason: User specified action: run junit/othervm ConnectionReuseTest
[2025-02-06T15:05:26.182Z] started: Thu Feb 06 15:04:56 UTC 2025
[2025-02-06T15:05:26.182Z] Mode: othervm [/othervm specified]
[2025-02-06T15:05:26.182Z] Additional options from @modules: --add-modules java.net.http,java.logging,java.base --add-exports java.net.http/jdk.internal.net.http.common=ALL-UNNAMED --add-exports java.net.http/jdk.internal.net.http.frame=ALL-UNNAMED --add-exports java.net.http/jdk.internal.net.http.hpack=ALL-UNNAMED --add-exports java.base/sun.net.www.http=ALL-UNNAMED --add-exports java.base/sun.net.www=ALL-UNNAMED --add-exports java.base/sun.net=ALL-UNNAMED
[2025-02-06T15:05:26.182Z] finished: Thu Feb 06 15:05:07 UTC 2025
[2025-02-06T15:05:26.182Z] elapsed time (seconds): 10.518
[2025-02-06T15:05:26.182Z] configuration:
[2025-02-06T15:05:26.182Z] Boot Layer
[2025-02-06T15:05:26.182Z] add modules: java.net.http java.logging java.base
[2025-02-06T15:05:26.182Z] add exports: java.base/sun.net ALL-UNNAMED
[2025-02-06T15:05:26.182Z] java.base/sun.net.www ALL-UNNAMED
[2025-02-06T15:05:26.182Z] java.base/sun.net.www.http ALL-UNNAMED
[2025-02-06T15:05:26.182Z] java.net.http/jdk.internal.net.http.common ALL-UNNAMED
[2025-02-06T15:05:26.182Z] java.net.http/jdk.internal.net.http.frame ALL-UNNAMED
[2025-02-06T15:05:26.182Z] java.net.http/jdk.internal.net.http.hpack ALL-UNNAMED
[2025-02-06T15:05:26.182Z]
[2025-02-06T15:05:26.182Z] STDOUT:
[2025-02-06T15:05:26.182Z] Http2TestServerImpl[localhost/127.0.0.1:46851]::addHandler ConnectionReuseTest$Handler@22d8072, /
[2025-02-06T15:05:26.182Z] Http2TestServerImpl: start
[2025-02-06T15:05:26.182Z] Started HTTP v2 server at localhost:46851
[2025-02-06T15:05:26.182Z] Http2TestServerImpl[localhost/127.0.0.1:48523]::addHandler ConnectionReuseTest$Handler@341005ee, /
[2025-02-06T15:05:26.182Z] Http2TestServerImpl: start
[2025-02-06T15:05:26.182Z] Started HTTPS v2 server at localhost:48523
[2025-02-06T15:05:26.182Z] Issuing request(1) https://localhost:48523/ GET
[2025-02-06T15:05:26.182Z] Http2TestContext::handle Http2TestExchangeImpl: Http2TestExchangeImpl@51c26a18
[2025-02-06T15:05:26.182Z] Handling request https://localhost:48523/ from /127.0.0.1:54530
[2025-02-06T15:05:26.182Z] Server side handler responded to a request from /127.0.0.1:54530
[2025-02-06T15:05:26.182Z] Issuing request(2) https://localhost:48523/ GET
[2025-02-06T15:05:26.182Z] Http2TestContext::handle Http2TestExchangeImpl: Http2TestExchangeImpl@49c7dc94
[2025-02-06T15:05:26.182Z] Handling request https://localhost:48523/ from /127.0.0.1:54530
[2025-02-06T15:05:26.182Z] Server side handler responded to a request from /127.0.0.1:54530
[2025-02-06T15:05:26.182Z] Issuing request(3) https://localhost:48523/ GET
[2025-02-06T15:05:26.182Z] Http2TestContext::handle Http2TestExchangeImpl: Http2TestExchangeImpl@2fda3241
[2025-02-06T15:05:26.182Z] Handling request https://localhost:48523/ from /127.0.0.1:54530
[2025-02-06T15:05:26.182Z] Server side handler responded to a request from /127.0.0.1:54530
[2025-02-06T15:05:26.182Z] Issuing request(4) https://localhost:48523/ GET
[2025-02-06T15:05:26.182Z] Http2TestContext::handle Http2TestExchangeImpl: Http2TestExchangeImpl@4b824d8c
[2025-02-06T15:05:26.182Z] Handling request https://localhost:48523/ from /127.0.0.1:54530
[2025-02-06T15:05:26.182Z] Server side handler responded to a request from /127.0.0.1:54530
[2025-02-06T15:05:26.182Z] Issuing request(5) https://localhost:48523/ GET
[2025-02-06T15:05:26.182Z] Http2TestContext::handle Http2TestExchangeImpl: Http2TestExchangeImpl@97890fc
[2025-02-06T15:05:26.182Z] Handling request https://localhost:48523/ from /127.0.0.1:54530
[2025-02-06T15:05:26.182Z] Server side handler responded to a request from /127.0.0.1:54530
[2025-02-06T15:05:26.182Z] PASSED: No outstanding operations found in 1 clients
[2025-02-06T15:05:26.182Z] Issuing request(1) http://localhost:46851/ GET
[2025-02-06T15:05:26.182Z] Http2TestContext::handle Http2TestExchangeImpl: Http2TestExchangeImpl@168914d3
[2025-02-06T15:05:26.182Z] Handling request http://localhost:46851/ from /127.0.0.1:42960
[2025-02-06T15:05:26.182Z] Server side handler responded to a request from /127.0.0.1:42960
[2025-02-06T15:05:26.182Z] Issuing request(2) http://localhost:46851/ GET
[2025-02-06T15:05:26.182Z] Http2TestContext::handle Http2TestExchangeImpl: Http2TestExchangeImpl@12b692da
[2025-02-06T15:05:26.182Z] Handling request http://localhost:46851/ from /127.0.0.1:42960
[2025-02-06T15:05:26.182Z] Server side handler responded to a request from /127.0.0.1:42960
[2025-02-06T15:05:26.182Z] Issuing request(3) http://localhost:46851/ GET
[2025-02-06T15:05:26.182Z] Http2TestContext::handle Http2TestExchangeImpl: Http2TestExchangeImpl@57b41ee8
[2025-02-06T15:05:26.182Z] Handling request http://localhost:46851/ from /127.0.0.1:42960
[2025-02-06T15:05:26.182Z] Server side handler responded to a request from /127.0.0.1:42960
[2025-02-06T15:05:26.182Z] Issuing request(4) http://localhost:46851/ GET
[2025-02-06T15:05:26.182Z] Http2TestContext::handle Http2TestExchangeImpl: Http2TestExchangeImpl@38d83e1d
[2025-02-06T15:05:26.182Z] Handling request http://localhost:46851/ from /127.0.0.1:42960
[2025-02-06T15:05:26.182Z] Server side handler responded to a request from /127.0.0.1:42960
[2025-02-06T15:05:26.182Z] Issuing request(5) http://localhost:46851/ GET
[2025-02-06T15:05:26.182Z] Http2TestContext::handle Http2TestExchangeImpl: Http2TestExchangeImpl@66a98a59
[2025-02-06T15:05:26.182Z] Handling request http://localhost:46851/ from /127.0.0.1:42960
[2025-02-06T15:05:26.182Z] Server side handler responded to a request from /127.0.0.1:42960
[2025-02-06T15:05:26.182Z] PASSED: No outstanding operations found in 2 clients
[2025-02-06T15:05:26.182Z] Stopping server HttpServerAdapters$HttpTestServer$Http2TestServerImpl@3aed786c
[2025-02-06T15:05:26.182Z] Http2TestServerImpl: stop
[2025-02-06T15:05:26.182Z] Stopping server HttpServerAdapters$HttpTestServer$Http2TestServerImpl@23a986b2
[2025-02-06T15:05:26.182Z] Http2TestServerImpl: stop
[2025-02-06T15:05:26.182Z] STDERR:
[2025-02-06T15:05:26.182Z] STARTED ConnectionReuseTest::testConnReuse '[1] https://localhost:48523/'
[2025-02-06T15:05:26.182Z] TestServer: New connection from Socket[addr=/127.0.0.1,port=54530,localport=48523]
[2025-02-06T15:05:26.182Z] TestServer: GET /
[2025-02-06T15:05:26.182Z] Server: got END_STREAM for stream 1
[2025-02-06T15:05:26.182Z] Using handler for: /
[2025-02-06T15:05:26.182Z] Sent response headers 200
[2025-02-06T15:05:26.182Z] TestServer: GET /
[2025-02-06T15:05:26.182Z] Server: got END_STREAM for stream 3
[2025-02-06T15:05:26.182Z] Using handler for: /
[2025-02-06T15:05:26.182Z] Sent response headers 200
[2025-02-06T15:05:26.182Z] TestServer: GET /
[2025-02-06T15:05:26.182Z] Server: got END_STREAM for stream 5
[2025-02-06T15:05:26.182Z] Using handler for: /
[2025-02-06T15:05:26.182Z] Sent response headers 200
[2025-02-06T15:05:26.182Z] TestServer: GET /
[2025-02-06T15:05:26.182Z] Server: got END_STREAM for stream 7
[2025-02-06T15:05:26.182Z] Using handler for: /
[2025-02-06T15:05:26.182Z] Sent response headers 200
[2025-02-06T15:05:26.182Z] TestServer: GET /
[2025-02-06T15:05:26.182Z] Server: got END_STREAM for stream 9
[2025-02-06T15:05:26.182Z] Using handler for: /
[2025-02-06T15:05:26.182Z] Sent response headers 200
[2025-02-06T15:05:26.182Z] SUCCESSFUL ConnectionReuseTest::testConnReuse '[1] https://localhost:48523/'
[2025-02-06T15:05:26.182Z] STARTED ConnectionReuseTest::testConnReuse '[2] http://localhost:46851/'
[2025-02-06T15:05:26.182Z] TestServer: New connection from Socket[addr=/127.0.0.1,port=42960,localport=46851]
[2025-02-06T15:05:26.182Z] TestServer: GET /
[2025-02-06T15:05:26.182Z] Server: creating input stream for stream 1
[2025-02-06T15:05:26.182Z] Using handler for: /
[2025-02-06T15:05:26.182Z] Sent response headers 200
[2025-02-06T15:05:26.182Z] TestServer: GET /
[2025-02-06T15:05:26.182Z] Server: got END_STREAM for stream 3
[2025-02-06T15:05:26.182Z] Using handler for: /
[2025-02-06T15:05:26.182Z] Sent response headers 200
[2025-02-06T15:05:26.182Z] TestServer: GET /
[2025-02-06T15:05:26.182Z] Server: got END_STREAM for stream 5
[2025-02-06T15:05:26.182Z] Using handler for: /
[2025-02-06T15:05:26.182Z] Sent response headers 200
[2025-02-06T15:05:26.182Z] TestServer: GET /
[2025-02-06T15:05:26.182Z] Server: got END_STREAM for stream 7
[2025-02-06T15:05:26.182Z] Using handler for: /
[2025-02-06T15:05:26.182Z] Sent response headers 200
[2025-02-06T15:05:26.182Z] TestServer: GET /
[2025-02-06T15:05:26.182Z] Server: got END_STREAM for stream 9
[2025-02-06T15:05:26.182Z] Using handler for: /
[2025-02-06T15:05:26.182Z] Sent response headers 200
[2025-02-06T15:05:26.182Z] SUCCESSFUL ConnectionReuseTest::testConnReuse '[2] http://localhost:46851/'
[2025-02-06T15:05:26.182Z] Server stopping 1 connections
[2025-02-06T15:05:26.182Z] Server connection to /127.0.0.1:54530 stopping. 5 streams
[2025-02-06T15:05:26.182Z] TestServer: Connection writer stopping
[2025-02-06T15:05:26.182Z] Server stopping 1 connections
[2025-02-06T15:05:26.182Z] Server connection to /127.0.0.1:42960 stopping. 5 streams
[2025-02-06T15:05:26.182Z] TestServer: Connection writer stopping
[2025-02-06T15:05:26.182Z]
[2025-02-06T15:05:26.182Z] [ JUnit Containers: found 5, started 5, succeeded 5, failed 0, aborted 0, skipped 0]
[2025-02-06T15:05:26.182Z] [ JUnit Tests: found 2, started 2, succeeded 2, failed 0, aborted 0, skipped 0]
[2025-02-06T15:05:26.182Z]
[2025-02-06T15:05:26.182Z] STATUS:Passed.
[2025-02-06T15:05:26.182Z] rerun:
[2025-02-06T15:05:26.183Z] cd /home/jenkins/workspace/Test_openjdk11_hs_extended.openjdk_s390x_linux_testList_4/aqa-tests/TKG/output_17388506952171/jdk_net_1/work/scratch && \
[2025-02-06T15:05:26.183Z] DBUS_SESSION_BUS_ADDRESS=unix:path=/run/user/1002/bus \
[2025-02-06T15:05:26.183Z] DISPLAY=:0 \
[2025-02-06T15:05:26.183Z] HOME=/home/jenkins \
[2025-02-06T15:05:26.183Z] LANG=C.UTF-8 \
[2025-02-06T15:05:26.183Z] PATH=/bin:/usr/bin:/usr/sbin \
[2025-02-06T15:05:26.183Z] XDG_RUNTIME_DIR=/run/user/1002 \
[2025-02-06T15:05:26.183Z] XDG_SESSION_CLASS=user \
[2025-02-06T15:05:26.183Z] XDG_SESSION_ID=125568 \
[2025-02-06T15:05:26.183Z] XDG_SESSION_TYPE=tty \
[2025-02-06T15:05:26.183Z] CLASSPATH=/home/jenkins/workspace/Test_openjdk11_hs_extended.openjdk_s390x_linux_testList_4/aqa-tests/TKG/output_17388506952171/jdk_net_1/work/classes/java/net/httpclient/http2/ConnectionReuseTest.d:/home/jenkins/workspace/Test_openjdk11_hs_extended.openjdk_s390x_linux_testList_4/aqa-tests/openjdk/openjdk-jdk/test/jdk/java/net/httpclient/http2:/home/jenkins/workspace/Test_openjdk11_hs_extended.openjdk_s390x_linux_testList_4/aqa-tests/TKG/output_17388506952171/jdk_net_1/work/classes/test/lib:/home/jenkins/workspace/Test_openjdk11_hs_extended.openjdk_s390x_linux_testList_4/aqa-tests/openjdk/openjdk-jdk/test/lib:/home/jenkins/workspace/Test_openjdk11_hs_extended.openjdk_s390x_linux_testList_4/aqa-tests/TKG/output_17388506952171/jdk_net_1/work/classes/java/net/httpclient/http2/server:/home/jenkins/workspace/Test_openjdk11_hs_extended.openjdk_s390x_linux_testList_4/aqa-tests/openjdk/openjdk-jdk/test/jdk/java/net/httpclient/http2/server:/home/jenkins/workspace/Test_openjdk11_hs_extended.openjdk_s390x_linux_testList_4/aqa-tests/TKG/output_17388506952171/jdk_net_1/work/classes/java/net/httpclient:/home/jenkins/workspace/Test_openjdk11_hs_extended.openjdk_s390x_linux_testList_4/aqa-tests/openjdk/openjdk-jdk/test/jdk/java/net/httpclient:/home/jenkins/workspace/Test_openjdk11_hs_extended.openjdk_s390x_linux_testList_4/jvmtest/openjdk/jtreg/lib/junit-platform-console-standalone-1.9.2.jar:/home/jenkins/workspace/Test_openjdk11_hs_extended.openjdk_s390x_linux_testList_4/jvmtest/openjdk/jtreg/lib/javatest.jar:/home/jenkins/workspace/Test_openjdk11_hs_extended.openjdk_s390x_linux_testList_4/jvmtest/openjdk/jtreg/lib/jtreg.jar \
[2025-02-06T15:05:26.183Z] /home/jenkins/workspace/Test_openjdk11_hs_extended.openjdk_s390x_linux_testList_4/jdkbinary/j2sdk-image/bin/java \
[2025-02-06T15:05:26.183Z] -Dtest.vm.opts='-ea -esa -Xmx512m -XX:-UseCompressedOops' \
[2025-02-06T15:05:26.183Z] -Dtest.tool.vm.opts='-J-ea -J-esa -J-Xmx512m -J-XX:-UseCompressedOops' \
[2025-02-06T15:05:26.183Z] -Dtest.compiler.opts= \
[2025-02-06T15:05:26.183Z] -Dtest.java.opts= \
[2025-02-06T15:05:26.183Z] -Dtest.jdk=/home/jenkins/workspace/Test_openjdk11_hs_extended.openjdk_s390x_linux_testList_4/jdkbinary/j2sdk-image \
[2025-02-06T15:05:26.183Z] -Dcompile.jdk=/home/jenkins/workspace/Test_openjdk11_hs_extended.openjdk_s390x_linux_testList_4/jdkbinary/j2sdk-image \
[2025-02-06T15:05:26.183Z] -Dtest.timeout.factor=8.0 \
[2025-02-06T15:05:26.183Z] -Dtest.nativepath=/home/jenkins/workspace/Test_openjdk11_hs_extended.openjdk_s390x_linux_testList_4/jdkbinary/openjdk-test-image/jdk/jtreg/native \
[2025-02-06T15:05:26.183Z] -Dtest.root=/home/jenkins/workspace/Test_openjdk11_hs_extended.openjdk_s390x_linux_testList_4/aqa-tests/openjdk/openjdk-jdk/test/jdk \
[2025-02-06T15:05:26.183Z] -Dtest.name=java/net/httpclient/http2/ConnectionReuseTest.java \
[2025-02-06T15:05:26.183Z] -Dtest.file=/home/jenkins/workspace/Test_openjdk11_hs_extended.openjdk_s390x_linux_testList_4/aqa-tests/openjdk/openjdk-jdk/test/jdk/java/net/httpclient/http2/ConnectionReuseTest.java \
[2025-02-06T15:05:26.183Z] -Dtest.src=/home/jenkins/workspace/Test_openjdk11_hs_extended.openjdk_s390x_linux_testList_4/aqa-tests/openjdk/openjdk-jdk/test/jdk/java/net/httpclient/http2 \
[2025-02-06T15:05:26.183Z] -Dtest.src.path=/home/jenkins/workspace/Test_openjdk11_hs_extended.openjdk_s390x_linux_testList_4/aqa-tests/openjdk/openjdk-jdk/test/jdk/java/net/httpclient/http2:/home/jenkins/workspace/Test_openjdk11_hs_extended.openjdk_s390x_linux_testList_4/aqa-tests/openjdk/openjdk-jdk/test/lib:/home/jenkins/workspace/Test_openjdk11_hs_extended.openjdk_s390x_linux_testList_4/aqa-tests/openjdk/openjdk-jdk/test/jdk/java/net/httpclient/http2/server:/home/jenkins/workspace/Test_openjdk11_hs_extended.openjdk_s390x_linux_testList_4/aqa-tests/openjdk/openjdk-jdk/test/jdk/java/net/httpclient \
[2025-02-06T15:05:26.183Z] -Dtest.classes=/home/jenkins/workspace/Test_openjdk11_hs_extended.openjdk_s390x_linux_testList_4/aqa-tests/TKG/output_17388506952171/jdk_net_1/work/classes/java/net/httpclient/http2/ConnectionReuseTest.d \
[2025-02-06T15:05:26.183Z] -Dtest.class.path=/home/jenkins/workspace/Test_openjdk11_hs_extended.openjdk_s390x_linux_testList_4/aqa-tests/TKG/output_17388506952171/jdk_net_1/work/classes/java/net/httpclient/http2/ConnectionReuseTest.d:/home/jenkins/workspace/Test_openjdk11_hs_extended.openjdk_s390x_linux_testList_4/aqa-tests/TKG/output_17388506952171/jdk_net_1/work/classes/test/lib:/home/jenkins/workspace/Test_openjdk11_hs_extended.openjdk_s390x_linux_testList_4/aqa-tests/TKG/output_17388506952171/jdk_net_1/work/classes/java/net/httpclient/http2/server:/home/jenkins/workspace/Test_openjdk11_hs_extended.openjdk_s390x_linux_testList_4/aqa-tests/TKG/output_17388506952171/jdk_net_1/work/classes/java/net/httpclient \
[2025-02-06T15:05:26.183Z] -Dtest.class.path.prefix=/home/jenkins/workspace/Test_openjdk11_hs_extended.openjdk_s390x_linux_testList_4/aqa-tests/TKG/output_17388506952171/jdk_net_1/work/classes/java/net/httpclient/http2/ConnectionReuseTest.d:/home/jenkins/workspace/Test_openjdk11_hs_extended.openjdk_s390x_linux_testList_4/aqa-tests/openjdk/openjdk-jdk/test/jdk/java/net/httpclient/http2:/home/jenkins/workspace/Test_openjdk11_hs_extended.openjdk_s390x_linux_testList_4/aqa-tests/TKG/output_17388506952171/jdk_net_1/work/classes/test/lib:/home/jenkins/workspace/Test_openjdk11_hs_extended.openjdk_s390x_linux_testList_4/aqa-tests/TKG/output_17388506952171/jdk_net_1/work/classes/java/net/httpclient/http2/server:/home/jenkins/workspace/Test_openjdk11_hs_extended.openjdk_s390x_linux_testList_4/aqa-tests/TKG/output_17388506952171/jdk_net_1/work/classes/java/net/httpclient \
[2025-02-06T15:05:26.183Z] -Dtest.modules='java.net.http/jdk.internal.net.http.common java.net.http/jdk.internal.net.http.frame java.net.http/jdk.internal.net.http.hpack java.logging java.base/sun.net.www.http java.base/sun.net.www java.base/sun.net' \
[2025-02-06T15:05:26.183Z] --add-modules java.net.http,java.logging,java.base \
[2025-02-06T15:05:26.183Z] --add-exports java.net.http/jdk.internal.net.http.common=ALL-UNNAMED \
[2025-02-06T15:05:26.183Z] --add-exports java.net.http/jdk.internal.net.http.frame=ALL-UNNAMED \
[2025-02-06T15:05:26.183Z] --add-exports java.net.http/jdk.internal.net.http.hpack=ALL-UNNAMED \
[2025-02-06T15:05:26.183Z] --add-exports java.base/sun.net.www.http=ALL-UNNAMED \
[2025-02-06T15:05:26.183Z] --add-exports java.base/sun.net.www=ALL-UNNAMED \
[2025-02-06T15:05:26.183Z] --add-exports java.base/sun.net=ALL-UNNAMED \
[2025-02-06T15:05:26.183Z] -ea \
[2025-02-06T15:05:26.183Z] -esa \
[2025-02-06T15:05:26.183Z] -Xmx512m \
[2025-02-06T15:05:26.183Z] -XX:-UseCompressedOops \
[2025-02-06T15:05:26.183Z] -Djava.library.path=/home/jenkins/workspace/Test_openjdk11_hs_extended.openjdk_s390x_linux_testList_4/jdkbinary/openjdk-test-image/jdk/jtreg/native \
[2025-02-06T15:05:26.183Z] com.sun.javatest.regtest.agent.MainWrapper /home/jenkins/workspace/Test_openjdk11_hs_extended.openjdk_s390x_linux_testList_4/aqa-tests/TKG/output_17388506952171/jdk_net_1/work/java/net/httpclient/http2/ConnectionReuseTest.d/junit.0.jta java/net/httpclient/http2/ConnectionReuseTest.java ConnectionReuseTest
[2025-02-06T15:05:26.183Z]
[2025-02-06T15:05:26.183Z] ACTION: build -- Passed. All files up to date
[2025-02-06T15:05:26.183Z] REASON: Named class compiled on demand
[2025-02-06T15:05:26.183Z] TIME: 0.0 seconds
[2025-02-06T15:05:26.183Z] messages:
[2025-02-06T15:05:26.183Z] command: build ConnectionReuseTest
[2025-02-06T15:05:26.183Z] reason: Named class compiled on demand
[2025-02-06T15:05:26.183Z] started: Thu Feb 06 15:05:07 UTC 2025
[2025-02-06T15:05:26.183Z] finished: Thu Feb 06 15:05:07 UTC 2025
[2025-02-06T15:05:26.183Z] elapsed time (seconds): 0.0
[2025-02-06T15:05:26.183Z]
[2025-02-06T15:05:26.183Z] ACTION: junit -- Failed. Execution failed: `main' threw exception: java.lang.Exception: JUnit test failure
[2025-02-06T15:05:26.183Z] REASON: User specified action: run junit/othervm -Djava.net.preferIPv6Addresses=true ConnectionReuseTest
[2025-02-06T15:05:26.183Z] TIME: 10.763 seconds
[2025-02-06T15:05:26.183Z] messages:
[2025-02-06T15:05:26.183Z] command: junit -Djava.net.preferIPv6Addresses=true ConnectionReuseTest
[2025-02-06T15:05:26.183Z] reason: User specified action: run junit/othervm -Djava.net.preferIPv6Addresses=true ConnectionReuseTest
[2025-02-06T15:05:26.183Z] started: Thu Feb 06 15:05:07 UTC 2025
[2025-02-06T15:05:26.183Z] Mode: othervm [/othervm specified]
[2025-02-06T15:05:26.183Z] Additional options from @modules: --add-modules java.net.http,java.logging,java.base --add-exports java.net.http/jdk.internal.net.http.common=ALL-UNNAMED --add-exports java.net.http/jdk.internal.net.http.frame=ALL-UNNAMED --add-exports java.net.http/jdk.internal.net.http.hpack=ALL-UNNAMED --add-exports java.base/sun.net.www.http=ALL-UNNAMED --add-exports java.base/sun.net.www=ALL-UNNAMED --add-exports java.base/sun.net=ALL-UNNAMED
[2025-02-06T15:05:26.183Z] finished: Thu Feb 06 15:05:17 UTC 2025
[2025-02-06T15:05:26.183Z] elapsed time (seconds): 10.763
[2025-02-06T15:05:26.183Z] configuration:
[2025-02-06T15:05:26.183Z] Boot Layer
[2025-02-06T15:05:26.183Z] add modules: java.net.http java.logging java.base
[2025-02-06T15:05:26.183Z] add exports: java.base/sun.net ALL-UNNAMED
[2025-02-06T15:05:26.183Z] java.base/sun.net.www ALL-UNNAMED
[2025-02-06T15:05:26.183Z] java.base/sun.net.www.http ALL-UNNAMED
[2025-02-06T15:05:26.183Z] java.net.http/jdk.internal.net.http.common ALL-UNNAMED
[2025-02-06T15:05:26.183Z] java.net.http/jdk.internal.net.http.frame ALL-UNNAMED
[2025-02-06T15:05:26.183Z] java.net.http/jdk.internal.net.http.hpack ALL-UNNAMED
[2025-02-06T15:05:26.183Z]
[2025-02-06T15:05:26.183Z] STDOUT:
[2025-02-06T15:05:26.183Z] Http2TestServerImpl[localhost/0:0:0:0:0:0:0:1:44795]::addHandler ConnectionReuseTest$Handler@7fb5e53e, /
[2025-02-06T15:05:26.183Z] Http2TestServerImpl: start
[2025-02-06T15:05:26.183Z] Started HTTP v2 server at localhost:44795
[2025-02-06T15:05:26.183Z] Http2TestServerImpl[localhost/0:0:0:0:0:0:0:1:50511]::addHandler ConnectionReuseTest$Handler@3e30cf90, /
[2025-02-06T15:05:26.183Z] Http2TestServerImpl: start
[2025-02-06T15:05:26.183Z] Started HTTPS v2 server at localhost:50511
[2025-02-06T15:05:26.183Z] Issuing request(1) https://localhost:50511/ GET
[2025-02-06T15:05:26.183Z] PASSED: No outstanding operations found in 1 clients
[2025-02-06T15:05:26.183Z] Issuing request(1) http://localhost:44795/ GET
[2025-02-06T15:05:26.183Z] PASSED: No outstanding operations found in 2 clients
[2025-02-06T15:05:26.183Z] Issuing request(1) http://[::1]:44795/ GET
[2025-02-06T15:05:26.183Z] Http2TestContext::handle Http2TestExchangeImpl: Http2TestExchangeImpl@1ece5137
[2025-02-06T15:05:26.183Z] Handling request http://[::1]:44795/ from /0:0:0:0:0:0:0:1:45222
[2025-02-06T15:05:26.183Z] Server side handler responded to a request from /0:0:0:0:0:0:0:1:45222
[2025-02-06T15:05:26.183Z] Issuing request(2) http://[::1]:44795/ GET
[2025-02-06T15:05:26.183Z] Http2TestContext::handle Http2TestExchangeImpl: Http2TestExchangeImpl@643864c9
[2025-02-06T15:05:26.183Z] Handling request http://[::1]:44795/ from /0:0:0:0:0:0:0:1:45222
[2025-02-06T15:05:26.183Z] Server side handler responded to a request from /0:0:0:0:0:0:0:1:45222
[2025-02-06T15:05:26.183Z] Issuing request(3) http://[::1]:44795/ GET
[2025-02-06T15:05:26.183Z] Http2TestContext::handle Http2TestExchangeImpl: Http2TestExchangeImpl@3eaa04d3
[2025-02-06T15:05:26.183Z] Handling request http://[::1]:44795/ from /0:0:0:0:0:0:0:1:45222
[2025-02-06T15:05:26.183Z] Server side handler responded to a request from /0:0:0:0:0:0:0:1:45222
[2025-02-06T15:05:26.183Z] Issuing request(4) http://[::1]:44795/ GET
[2025-02-06T15:05:26.183Z] Http2TestContext::handle Http2TestExchangeImpl: Http2TestExchangeImpl@482e70f6
[2025-02-06T15:05:26.183Z] Handling request http://[::1]:44795/ from /0:0:0:0:0:0:0:1:45222
[2025-02-06T15:05:26.183Z] Server side handler responded to a request from /0:0:0:0:0:0:0:1:45222
[2025-02-06T15:05:26.183Z] Issuing request(5) http://[::1]:44795/ GET
[2025-02-06T15:05:26.183Z] Http2TestContext::handle Http2TestExchangeImpl: Http2TestExchangeImpl@1f79a309
[2025-02-06T15:05:26.183Z] Handling request http://[::1]:44795/ from /0:0:0:0:0:0:0:1:45222
[2025-02-06T15:05:26.183Z] Server side handler responded to a request from /0:0:0:0:0:0:0:1:45222
[2025-02-06T15:05:26.183Z] PASSED: No outstanding operations found in 3 clients
[2025-02-06T15:05:26.183Z] Stopping server HttpServerAdapters$HttpTestServer$Http2TestServerImpl@491860cb
[2025-02-06T15:05:26.183Z] Http2TestServerImpl: stop
[2025-02-06T15:05:26.183Z] Stopping server HttpServerAdapters$HttpTestServer$Http2TestServerImpl@2408c0e7
[2025-02-06T15:05:26.183Z] Http2TestServerImpl: stop
[2025-02-06T15:05:26.183Z] STDERR:
[2025-02-06T15:05:26.183Z] IPSupport - IPv4: true
[2025-02-06T15:05:26.183Z] IPSupport - IPv6: true
[2025-02-06T15:05:26.183Z] preferIPv4Stack: false
[2025-02-06T15:05:26.183Z] preferIPv6Addresses: true
[2025-02-06T15:05:26.183Z] STARTED ConnectionReuseTest::testConnReuse '[1] https://localhost:50511/'
[2025-02-06T15:05:26.183Z] java.net.ConnectException: Connection refused
[2025-02-06T15:05:26.183Z] at java.net.http/jdk.internal.net.http.HttpClientImpl.send(HttpClientImpl.java:562)
[2025-02-06T15:05:26.183Z] at java.net.http/jdk.internal.net.http.HttpClientFacade.send(HttpClientFacade.java:119)
[2025-02-06T15:05:26.183Z] at ConnectionReuseTest.testConnReuse(ConnectionReuseTest.java:147)
[2025-02-06T15:05:26.183Z] at java.base/jdk.internal.reflect.NativeMethodAccessorImpl.invoke0(Native Method)
[2025-02-06T15:05:26.183Z] at java.base/jdk.internal.reflect.NativeMethodAccessorImpl.invoke(NativeMethodAccessorImpl.java:62)
[2025-02-06T15:05:26.183Z] at java.base/jdk.internal.reflect.DelegatingMethodAccessorImpl.invoke(DelegatingMethodAccessorImpl.java:43)
[2025-02-06T15:05:26.183Z] at java.base/java.lang.reflect.Method.invoke(Method.java:566)
[2025-02-06T15:05:26.183Z] at org.junit.platform.commons.util.ReflectionUtils.invokeMethod(ReflectionUtils.java:727)
[2025-02-06T15:05:26.183Z] at org.junit.jupiter.engine.execution.MethodInvocation.proceed(MethodInvocation.java:60)
[2025-02-06T15:05:26.183Z] at org.junit.jupiter.engine.execution.InvocationInterceptorChain$ValidatingInvocation.proceed(InvocationInterceptorChain.java:131)
[2025-02-06T15:05:26.183Z] at org.junit.jupiter.engine.extension.TimeoutExtension.intercept(TimeoutExtension.java:156)
[2025-02-06T15:05:26.183Z] at org.junit.jupiter.engine.extension.TimeoutExtension.interceptTestableMethod(TimeoutExtension.java:147)
[2025-02-06T15:05:26.183Z] at org.junit.jupiter.engine.extension.TimeoutExtension.interceptTestTemplateMethod(TimeoutExtension.java:94)
[2025-02-06T15:05:26.183Z] at org.junit.jupiter.engine.execution.InterceptingExecutableInvoker$ReflectiveInterceptorCall.lambda$ofVoidMethod$0(InterceptingExecutableInvoker.java:103)
[2025-02-06T15:05:26.183Z] at org.junit.jupiter.engine.execution.InterceptingExecutableInvoker.lambda$invoke$0(InterceptingExecutableInvoker.java:93)
[2025-02-06T15:05:26.183Z] at org.junit.jupiter.engine.execution.InvocationInterceptorChain$InterceptedInvocation.proceed(InvocationInterceptorChain.java:106)
[2025-02-06T15:05:26.183Z] at org.junit.jupiter.engine.execution.InvocationInterceptorChain.proceed(InvocationInterceptorChain.java:64)
[2025-02-06T15:05:26.183Z] at org.junit.jupiter.engine.execution.InvocationInterceptorChain.chainAndInvoke(InvocationInterceptorChain.java:45)
[2025-02-06T15:05:26.183Z] at org.junit.jupiter.engine.execution.InvocationInterceptorChain.invoke(InvocationInterceptorChain.java:37)
[2025-02-06T15:05:26.183Z] at org.junit.jupiter.engine.execution.InterceptingExecutableInvoker.invoke(InterceptingExecutableInvoker.java:92)
[2025-02-06T15:05:26.183Z] at org.junit.jupiter.engine.execution.InterceptingExecutableInvoker.invoke(InterceptingExecutableInvoker.java:86)
[2025-02-06T15:05:26.183Z] at org.junit.jupiter.engine.descriptor.TestMethodTestDescriptor.lambda$invokeTestMethod$7(TestMethodTestDescriptor.java:217)
[2025-02-06T15:05:26.183Z] at org.junit.platform.engine.support.hierarchical.ThrowableCollector.execute(ThrowableCollector.java:73)
[2025-02-06T15:05:26.183Z] at org.junit.jupiter.engine.descriptor.TestMethodTestDescriptor.invokeTestMethod(TestMethodTestDescriptor.java:213)
[2025-02-06T15:05:26.183Z] at org.junit.jupiter.engine.descriptor.TestMethodTestDescriptor.execute(TestMethodTestDescriptor.java:138)
[2025-02-06T15:05:26.184Z] at org.junit.jupiter.engine.descriptor.TestMethodTestDescriptor.execute(TestMethodTestDescriptor.java:68)
[2025-02-06T15:05:26.184Z] at org.junit.platform.engine.support.hierarchical.NodeTestTask.lambda$executeRecursively$6(NodeTestTask.java:151)
[2025-02-06T15:05:26.184Z] at org.junit.platform.engine.support.hierarchical.ThrowableCollector.execute(ThrowableCollector.java:73)
[2025-02-06T15:05:26.184Z] at org.junit.platform.engine.support.hierarchical.NodeTestTask.lambda$executeRecursively$8(NodeTestTask.java:141)
[2025-02-06T15:05:26.184Z] at org.junit.platform.engine.support.hierarchical.Node.around(Node.java:137)
[2025-02-06T15:05:26.184Z] at org.junit.platform.engine.support.hierarchical.NodeTestTask.lambda$executeRecursively$9(NodeTestTask.java:139)
[2025-02-06T15:05:26.184Z] at org.junit.platform.engine.support.hierarchical.ThrowableCollector.execute(ThrowableCollector.java:73)
[2025-02-06T15:05:26.184Z] at org.junit.platform.engine.support.hierarchical.NodeTestTask.executeRecursively(NodeTestTask.java:138)
[2025-02-06T15:05:26.184Z] at org.junit.platform.engine.support.hierarchical.NodeTestTask.execute(NodeTestTask.java:95)
[2025-02-06T15:05:26.184Z] at org.junit.platform.engine.support.hierarchical.SameThreadHierarchicalTestExecutorService.submit(SameThreadHierarchicalTestExecutorService.java:35)
[2025-02-06T15:05:26.184Z] at org.junit.platform.engine.support.hierarchical.NodeTestTask$DefaultDynamicTestExecutor.execute(NodeTestTask.java:226)
[2025-02-06T15:05:26.184Z] at org.junit.platform.engine.support.hierarchical.NodeTestTask$DefaultDynamicTestExecutor.execute(NodeTestTask.java:204)
[2025-02-06T15:05:26.184Z] at org.junit.jupiter.engine.descriptor.TestTemplateTestDescriptor.execute(TestTemplateTestDescriptor.java:142)
[2025-02-06T15:05:26.184Z] at org.junit.jupiter.engine.descriptor.TestTemplateTestDescriptor.lambda$execute$2(TestTemplateTestDescriptor.java:110)
[2025-02-06T15:05:26.184Z] at java.base/java.util.stream.ForEachOps$ForEachOp$OfRef.accept(ForEachOps.java:183)
[2025-02-06T15:05:26.184Z] at java.base/java.util.stream.ReferencePipeline$3$1.accept(ReferencePipeline.java:195)
[2025-02-06T15:05:26.184Z] at java.base/java.util.stream.ReferencePipeline$2$1.accept(ReferencePipeline.java:177)
[2025-02-06T15:05:26.184Z] at java.base/java.util.stream.ReferencePipeline$3$1.accept(ReferencePipeline.java:195)
[2025-02-06T15:05:26.184Z] at java.base/java.util.stream.ForEachOps$ForEachOp$OfRef.accept(ForEachOps.java:183)
[2025-02-06T15:05:26.184Z] at java.base/java.util.stream.ReferencePipeline$3$1.accept(ReferencePipeline.java:195)
[2025-02-06T15:05:26.184Z] at java.base/java.util.stream.ReferencePipeline$3$1.accept(ReferencePipeline.java:195)
[2025-02-06T15:05:26.184Z] at java.base/java.util.stream.ReferencePipeline$3$1.accept(ReferencePipeline.java:195)
[2025-02-06T15:05:26.184Z] at java.base/java.util.stream.ForEachOps$ForEachOp$OfRef.accept(ForEachOps.java:183)
[2025-02-06T15:05:26.184Z] at java.base/java.util.stream.ReferencePipeline$3$1.accept(ReferencePipeline.java:195)
[2025-02-06T15:05:26.184Z] at java.base/java.util.ArrayList$ArrayListSpliterator.forEachRemaining(ArrayList.java:1655)
[2025-02-06T15:05:26.184Z] at java.base/java.util.stream.ReferencePipeline$Head.forEach(ReferencePipeline.java:658)
[2025-02-06T15:05:26.184Z] at java.base/java.util.stream.ReferencePipeline$7$1.accept(ReferencePipeline.java:274)
[2025-02-06T15:05:26.184Z] at java.base/java.util.stream.ReferencePipeline$3$1.accept(ReferencePipeline.java:195)
[2025-02-06T15:05:26.184Z] at java.base/java.util.stream.ReferencePipeline$3$1.accept(ReferencePipeline.java:195)
[2025-02-06T15:05:26.184Z] at java.base/java.util.Spliterators$ArraySpliterator.forEachRemaining(Spliterators.java:948)
[2025-02-06T15:05:26.184Z] at java.base/java.util.stream.AbstractPipeline.copyInto(AbstractPipeline.java:484)
[2025-02-06T15:05:26.184Z] at java.base/java.util.stream.AbstractPipeline.wrapAndCopyInto(AbstractPipeline.java:474)
[2025-02-06T15:05:26.184Z] at java.base/java.util.stream.ForEachOps$ForEachOp.evaluateSequential(ForEachOps.java:150)
[2025-02-06T15:05:26.184Z] at java.base/java.util.stream.ForEachOps$ForEachOp$OfRef.evaluateSequential(ForEachOps.java:173)
[2025-02-06T15:05:26.184Z] at java.base/java.util.stream.AbstractPipeline.evaluate(AbstractPipeline.java:234)
[2025-02-06T15:05:26.184Z] at java.base/java.util.stream.ReferencePipeline.forEach(ReferencePipeline.java:497)
[2025-02-06T15:05:26.184Z] at java.base/java.util.stream.ReferencePipeline$7$1.accept(ReferencePipeline.java:274)
[2025-02-06T15:05:26.184Z] at java.base/java.util.stream.ReferencePipeline$3$1.accept(ReferencePipeline.java:195)
[2025-02-06T15:05:26.184Z] at java.base/java.util.stream.ReferencePipeline$3$1.accept(ReferencePipeline.java:195)
[2025-02-06T15:05:26.184Z] at java.base/java.util.stream.ReferencePipeline$3$1.accept(ReferencePipeline.java:195)
[2025-02-06T15:05:26.184Z] at java.base/java.util.ArrayList$ArrayListSpliterator.forEachRemaining(ArrayList.java:1655)
[2025-02-06T15:05:26.184Z] at java.base/java.util.stream.AbstractPipeline.copyInto(AbstractPipeline.java:484)
[2025-02-06T15:05:26.184Z] at java.base/java.util.stream.AbstractPipeline.wrapAndCopyInto(AbstractPipeline.java:474)
[2025-02-06T15:05:26.184Z] at java.base/java.util.stream.ForEachOps$ForEachOp.evaluateSequential(ForEachOps.java:150)
[2025-02-06T15:05:26.184Z] at java.base/java.util.stream.ForEachOps$ForEachOp$OfRef.evaluateSequential(ForEachOps.java:173)
[2025-02-06T15:05:26.184Z] at java.base/java.util.stream.AbstractPipeline.evaluate(AbstractPipeline.java:234)
[2025-02-06T15:05:26.184Z] at java.base/java.util.stream.ReferencePipeline.forEach(ReferencePipeline.java:497)
[2025-02-06T15:05:26.184Z] at java.base/java.util.stream.ReferencePipeline$7$1.accept(ReferencePipeline.java:274)
[2025-02-06T15:05:26.184Z] at java.base/java.util.ArrayList$ArrayListSpliterator.forEachRemaining(ArrayList.java:1655)
[2025-02-06T15:05:26.184Z] at java.base/java.util.stream.AbstractPipeline.copyInto(AbstractPipeline.java:484)
[2025-02-06T15:05:26.184Z] at java.base/java.util.stream.AbstractPipeline.wrapAndCopyInto(AbstractPipeline.java:474)
[2025-02-06T15:05:26.184Z] at java.base/java.util.stream.ForEachOps$ForEachOp.evaluateSequential(ForEachOps.java:150)
[2025-02-06T15:05:26.184Z] at java.base/java.util.stream.ForEachOps$ForEachOp$OfRef.evaluateSequential(ForEachOps.java:173)
[2025-02-06T15:05:26.184Z] at java.base/java.util.stream.AbstractPipeline.evaluate(AbstractPipeline.java:234)
[2025-02-06T15:05:26.184Z] at java.base/java.util.stream.ReferencePipeline.forEach(ReferencePipeline.java:497)
[2025-02-06T15:05:26.184Z] at org.junit.jupiter.engine.descriptor.TestTemplateTestDescriptor.execute(TestTemplateTestDescriptor.java:110)
[2025-02-06T15:05:26.184Z] at org.junit.jupiter.engine.descriptor.TestTemplateTestDescriptor.execute(TestTemplateTestDescriptor.java:44)
[2025-02-06T15:05:26.184Z] at org.junit.platform.engine.support.hierarchical.NodeTestTask.lambda$executeRecursively$6(NodeTestTask.java:151)
[2025-02-06T15:05:26.184Z] at org.junit.platform.engine.support.hierarchical.ThrowableCollector.execute(ThrowableCollector.java:73)
[2025-02-06T15:05:26.184Z] at org.junit.platform.engine.support.hierarchical.NodeTestTask.lambda$executeRecursively$8(NodeTestTask.java:141)
[2025-02-06T15:05:26.184Z] at org.junit.platform.engine.support.hierarchical.Node.around(Node.java:137)
[2025-02-06T15:05:26.184Z] at org.junit.platform.engine.support.hierarchical.NodeTestTask.lambda$executeRecursively$9(NodeTestTask.java:139)
[2025-02-06T15:05:26.184Z] at org.junit.platform.engine.support.hierarchical.ThrowableCollector.execute(ThrowableCollector.java:73)
[2025-02-06T15:05:26.184Z] at org.junit.platform.engine.support.hierarchical.NodeTestTask.executeRecursively(NodeTestTask.java:138)
[2025-02-06T15:05:26.184Z] at org.junit.platform.engine.support.hierarchical.NodeTestTask.execute(NodeTestTask.java:95)
[2025-02-06T15:05:26.184Z] at java.base/java.util.ArrayList.forEach(ArrayList.java:1541)
[2025-02-06T15:05:26.184Z] at org.junit.platform.engine.support.hierarchical.SameThreadHierarchicalTestExecutorService.invokeAll(SameThreadHierarchicalTestExecutorService.java:41)
[2025-02-06T15:05:26.184Z] at org.junit.platform.engine.support.hierarchical.NodeTestTask.lambda$executeRecursively$6(NodeTestTask.java:155)
[2025-02-06T15:05:26.184Z] at org.junit.platform.engine.support.hierarchical.ThrowableCollector.execute(ThrowableCollector.java:73)
[2025-02-06T15:05:26.184Z] at org.junit.platform.engine.support.hierarchical.NodeTestTask.lambda$executeRecursively$8(NodeTestTask.java:141)
[2025-02-06T15:05:26.184Z] at org.junit.platform.engine.support.hierarchical.Node.around(Node.java:137)
[2025-02-06T15:05:26.184Z] at org.junit.platform.engine.support.hierarchical.NodeTestTask.lambda$executeRecursively$9(NodeTestTask.java:139)
[2025-02-06T15:05:26.184Z] at org.junit.platform.engine.support.hierarchical.ThrowableCollector.execute(ThrowableCollector.java:73)
[2025-02-06T15:05:26.184Z] at org.junit.platform.engine.support.hierarchical.NodeTestTask.executeRecursively(NodeTestTask.java:138)
[2025-02-06T15:05:26.184Z] at org.junit.platform.engine.support.hierarchical.NodeTestTask.execute(NodeTestTask.java:95)
[2025-02-06T15:05:26.184Z] at java.base/java.util.ArrayList.forEach(ArrayList.java:1541)
[2025-02-06T15:05:26.184Z] at org.junit.platform.engine.support.hierarchical.SameThreadHierarchicalTestExecutorService.invokeAll(SameThreadHierarchicalTestExecutorService.java:41)
[2025-02-06T15:05:26.184Z] at org.junit.platform.engine.support.hierarchical.NodeTestTask.lambda$executeRecursively$6(NodeTestTask.java:155)
[2025-02-06T15:05:26.184Z] at org.junit.platform.engine.support.hierarchical.ThrowableCollector.execute(ThrowableCollector.java:73)
[2025-02-06T15:05:26.184Z] at org.junit.platform.engine.support.hierarchical.NodeTestTask.lambda$executeRecursively$8(NodeTestTask.java:141)
[2025-02-06T15:05:26.184Z] at org.junit.platform.engine.support.hierarchical.Node.around(Node.java:137)
[2025-02-06T15:05:26.184Z] at org.junit.platform.engine.support.hierarchical.NodeTestTask.lambda$executeRecursively$9(NodeTestTask.java:139)
[2025-02-06T15:05:26.184Z] at org.junit.platform.engine.support.hierarchical.ThrowableCollector.execute(ThrowableCollector.java:73)
[2025-02-06T15:05:26.184Z] at org.junit.platform.engine.support.hierarchical.NodeTestTask.executeRecursively(NodeTestTask.java:138)
[2025-02-06T15:05:26.184Z] at org.junit.platform.engine.support.hierarchical.NodeTestTask.execute(NodeTestTask.java:95)
[2025-02-06T15:05:26.184Z] at org.junit.platform.engine.support.hierarchical.SameThreadHierarchicalTestExecutorService.submit(SameThreadHierarchicalTestExecutorService.java:35)
[2025-02-06T15:05:26.184Z] at org.junit.platform.engine.support.hierarchical.HierarchicalTestExecutor.execute(HierarchicalTestExecutor.java:57)
[2025-02-06T15:05:26.184Z] at org.junit.platform.engine.support.hierarchical.HierarchicalTestEngine.execute(HierarchicalTestEngine.java:54)
[2025-02-06T15:05:26.184Z] at org.junit.platform.launcher.core.EngineExecutionOrchestrator.execute(EngineExecutionOrchestrator.java:147)
[2025-02-06T15:05:26.184Z] at org.junit.platform.launcher.core.EngineExecutionOrchestrator.execute(EngineExecutionOrchestrator.java:127)
[2025-02-06T15:05:26.184Z] at org.junit.platform.launcher.core.EngineExecutionOrchestrator.execute(EngineExecutionOrchestrator.java:90)
[2025-02-06T15:05:26.184Z] at org.junit.platform.launcher.core.EngineExecutionOrchestrator.lambda$execute$0(EngineExecutionOrchestrator.java:55)
[2025-02-06T15:05:26.184Z] at org.junit.platform.launcher.core.EngineExecutionOrchestrator.withInterceptedStreams(EngineExecutionOrchestrator.java:102)
[2025-02-06T15:05:26.184Z] at org.junit.platform.launcher.core.EngineExecutionOrchestrator.execute(EngineExecutionOrchestrator.java:54)
[2025-02-06T15:05:26.184Z] at org.junit.platform.launcher.core.DefaultLauncher.execute(DefaultLauncher.java:114)
[2025-02-06T15:05:26.184Z] at org.junit.platform.launcher.core.DefaultLauncher.execute(DefaultLauncher.java:86)
[2025-02-06T15:05:26.184Z] at org.junit.platform.launcher.core.DefaultLauncherSession$DelegatingLauncher.execute(DefaultLauncherSession.java:86)
[2025-02-06T15:05:26.184Z] at com.sun.javatest.regtest.agent.JUnitRunner.runWithJUnitPlatform(JUnitRunner.java:142)
[2025-02-06T15:05:26.184Z] at com.sun.javatest.regtest.agent.JUnitRunner.main(JUnitRunner.java:95)
[2025-02-06T15:05:26.184Z] at com.sun.javatest.regtest.agent.JUnitRunner.main(JUnitRunner.java:61)
[2025-02-06T15:05:26.184Z] at java.base/jdk.internal.reflect.NativeMethodAccessorImpl.invoke0(Native Method)
[2025-02-06T15:05:26.184Z] at java.base/jdk.internal.reflect.NativeMethodAccessorImpl.invoke(NativeMethodAccessorImpl.java:62)
[2025-02-06T15:05:26.184Z] at java.base/jdk.internal.reflect.DelegatingMethodAccessorImpl.invoke(DelegatingMethodAccessorImpl.java:43)
[2025-02-06T15:05:26.184Z] at java.base/java.lang.reflect.Method.invoke(Method.java:566)
[2025-02-06T15:05:26.184Z] at com.sun.javatest.regtest.agent.MainWrapper$MainTask.run(MainWrapper.java:138)
[2025-02-06T15:05:26.184Z] at java.base/java.lang.Thread.run(Thread.java:829)
[2025-02-06T15:05:26.184Z] Caused by: java.net.ConnectException: Connection refused
[2025-02-06T15:05:26.184Z] at java.base/sun.nio.ch.SocketChannelImpl.checkConnect(Native Method)
[2025-02-06T15:05:26.184Z] at java.base/sun.nio.ch.SocketChannelImpl.finishConnect(SocketChannelImpl.java:777)
[2025-02-06T15:05:26.184Z] at java.net.http/jdk.internal.net.http.PlainHttpConnection$ConnectEvent.handle(PlainHttpConnection.java:128)
[2025-02-06T15:05:26.184Z] at java.net.http/jdk.internal.net.http.HttpClientImpl$SelectorManager.handleEvent(HttpClientImpl.java:962)
[2025-02-06T15:05:26.184Z] at java.net.http/jdk.internal.net.http.HttpClientImpl$SelectorManager.lambda$run$3(HttpClientImpl.java:917)
[2025-02-06T15:05:26.184Z] at java.base/java.util.ArrayList.forEach(ArrayList.java:1541)
[2025-02-06T15:05:26.184Z] at java.net.http/jdk.internal.net.http.HttpClientImpl$SelectorManager.run(HttpClientImpl.java:917)
[2025-02-06T15:05:26.184Z] FAILED ConnectionReuseTest::testConnReuse '[1] https://localhost:50511/'
[2025-02-06T15:05:26.184Z] STARTED ConnectionReuseTest::testConnReuse '[2] http://localhost:44795/'
[2025-02-06T15:05:26.184Z] java.net.ConnectException: Connection refused
[2025-02-06T15:05:26.184Z] at java.net.http/jdk.internal.net.http.HttpClientImpl.send(HttpClientImpl.java:562)
[2025-02-06T15:05:26.184Z] at java.net.http/jdk.internal.net.http.HttpClientFacade.send(HttpClientFacade.java:119)
[2025-02-06T15:05:26.184Z] at ConnectionReuseTest.testConnReuse(ConnectionReuseTest.java:147)
[2025-02-06T15:05:26.184Z] at java.base/jdk.internal.reflect.NativeMethodAccessorImpl.invoke0(Native Method)
[2025-02-06T15:05:26.184Z] at java.base/jdk.internal.reflect.NativeMethodAccessorImpl.invoke(NativeMethodAccessorImpl.java:62)
[2025-02-06T15:05:26.184Z] at java.base/jdk.internal.reflect.DelegatingMethodAccessorImpl.invoke(DelegatingMethodAccessorImpl.java:43)
[2025-02-06T15:05:26.184Z] at java.base/java.lang.reflect.Method.invoke(Method.java:566)
[2025-02-06T15:05:26.184Z] at org.junit.platform.commons.util.ReflectionUtils.invokeMethod(ReflectionUtils.java:727)
[2025-02-06T15:05:26.184Z] at org.junit.jupiter.engine.execution.MethodInvocation.proceed(MethodInvocation.java:60)
[2025-02-06T15:05:26.184Z] at org.junit.jupiter.engine.execution.InvocationInterceptorChain$ValidatingInvocation.proceed(InvocationInterceptorChain.java:131)
[2025-02-06T15:05:26.184Z] at org.junit.jupiter.engine.extension.TimeoutExtension.intercept(TimeoutExtension.java:156)
[2025-02-06T15:05:26.184Z] at org.junit.jupiter.engine.extension.TimeoutExtension.interceptTestableMethod(TimeoutExtension.java:147)
[2025-02-06T15:05:26.184Z] at org.junit.jupiter.engine.extension.TimeoutExtension.interceptTestTemplateMethod(TimeoutExtension.java:94)
[2025-02-06T15:05:26.184Z] at org.junit.jupiter.engine.execution.InterceptingExecutableInvoker$ReflectiveInterceptorCall.lambda$ofVoidMethod$0(InterceptingExecutableInvoker.java:103)
[2025-02-06T15:05:26.184Z] at org.junit.jupiter.engine.execution.InterceptingExecutableInvoker.lambda$invoke$0(InterceptingExecutableInvoker.java:93)
[2025-02-06T15:05:26.184Z] at org.junit.jupiter.engine.execution.InvocationInterceptorChain$InterceptedInvocation.proceed(InvocationInterceptorChain.java:106)
[2025-02-06T15:05:26.184Z] at org.junit.jupiter.engine.execution.InvocationInterceptorChain.proceed(InvocationInterceptorChain.java:64)
[2025-02-06T15:05:26.184Z] at org.junit.jupiter.engine.execution.InvocationInterceptorChain.chainAndInvoke(InvocationInterceptorChain.java:45)
[2025-02-06T15:05:26.184Z] at org.junit.jupiter.engine.execution.InvocationInterceptorChain.invoke(InvocationInterceptorChain.java:37)
[2025-02-06T15:05:26.184Z] at org.junit.jupiter.engine.execution.InterceptingExecutableInvoker.invoke(InterceptingExecutableInvoker.java:92)
[2025-02-06T15:05:26.184Z] at org.junit.jupiter.engine.execution.InterceptingExecutableInvoker.invoke(InterceptingExecutableInvoker.java:86)
[2025-02-06T15:05:26.184Z] at org.junit.jupiter.engine.descriptor.TestMethodTestDescriptor.lambda$invokeTestMethod$7(TestMethodTestDescriptor.java:217)
[2025-02-06T15:05:26.184Z] at org.junit.platform.engine.support.hierarchical.ThrowableCollector.execute(ThrowableCollector.java:73)
[2025-02-06T15:05:26.184Z] at org.junit.jupiter.engine.descriptor.TestMethodTestDescriptor.invokeTestMethod(TestMethodTestDescriptor.java:213)
[2025-02-06T15:05:26.184Z] at org.junit.jupiter.engine.descriptor.TestMethodTestDescriptor.execute(TestMethodTestDescriptor.java:138)
[2025-02-06T15:05:26.184Z] at org.junit.jupiter.engine.descriptor.TestMethodTestDescriptor.execute(TestMethodTestDescriptor.java:68)
[2025-02-06T15:05:26.184Z] at org.junit.platform.engine.support.hierarchical.NodeTestTask.lambda$executeRecursively$6(NodeTestTask.java:151)
[2025-02-06T15:05:26.184Z] at org.junit.platform.engine.support.hierarchical.ThrowableCollector.execute(ThrowableCollector.java:73)
[2025-02-06T15:05:26.184Z] at org.junit.platform.engine.support.hierarchical.NodeTestTask.lambda$executeRecursively$8(NodeTestTask.java:141)
[2025-02-06T15:05:26.184Z] at org.junit.platform.engine.support.hierarchical.Node.around(Node.java:137)
[2025-02-06T15:05:26.184Z] at org.junit.platform.engine.support.hierarchical.NodeTestTask.lambda$executeRecursively$9(NodeTestTask.java:139)
[2025-02-06T15:05:26.184Z] at org.junit.platform.engine.support.hierarchical.ThrowableCollector.execute(ThrowableCollector.java:73)
[2025-02-06T15:05:26.184Z] at org.junit.platform.engine.support.hierarchical.NodeTestTask.executeRecursively(NodeTestTask.java:138)
[2025-02-06T15:05:26.184Z] at org.junit.platform.engine.support.hierarchical.NodeTestTask.execute(NodeTestTask.java:95)
[2025-02-06T15:05:26.184Z] at org.junit.platform.engine.support.hierarchical.SameThreadHierarchicalTestExecutorService.submit(SameThreadHierarchicalTestExecutorService.java:35)
[2025-02-06T15:05:26.184Z] at org.junit.platform.engine.support.hierarchical.NodeTestTask$DefaultDynamicTestExecutor.execute(NodeTestTask.java:226)
[2025-02-06T15:05:26.184Z] at org.junit.platform.engine.support.hierarchical.NodeTestTask$DefaultDynamicTestExecutor.execute(NodeTestTask.java:204)
[2025-02-06T15:05:26.184Z] at org.junit.jupiter.engine.descriptor.TestTemplateTestDescriptor.execute(TestTemplateTestDescriptor.java:142)
[2025-02-06T15:05:26.184Z] at org.junit.jupiter.engine.descriptor.TestTemplateTestDescriptor.lambda$execute$2(TestTemplateTestDescriptor.java:110)
[2025-02-06T15:05:26.184Z] at java.base/java.util.stream.ForEachOps$ForEachOp$OfRef.accept(ForEachOps.java:183)
[2025-02-06T15:05:26.184Z] at java.base/java.util.stream.ReferencePipeline$3$1.accept(ReferencePipeline.java:195)
[2025-02-06T15:05:26.184Z] at java.base/java.util.stream.ReferencePipeline$2$1.accept(ReferencePipeline.java:177)
[2025-02-06T15:05:26.184Z] at java.base/java.util.stream.ReferencePipeline$3$1.accept(ReferencePipeline.java:195)
[2025-02-06T15:05:26.184Z] at java.base/java.util.stream.ForEachOps$ForEachOp$OfRef.accept(ForEachOps.java:183)
[2025-02-06T15:05:26.184Z] at java.base/java.util.stream.ReferencePipeline$3$1.accept(ReferencePipeline.java:195)
[2025-02-06T15:05:26.184Z] at java.base/java.util.stream.ReferencePipeline$3$1.accept(ReferencePipeline.java:195)
[2025-02-06T15:05:26.184Z] at java.base/java.util.stream.ReferencePipeline$3$1.accept(ReferencePipeline.java:195)
[2025-02-06T15:05:26.184Z] at java.base/java.util.stream.ForEachOps$ForEachOp$OfRef.accept(ForEachOps.java:183)
[2025-02-06T15:05:26.184Z] at java.base/java.util.stream.ReferencePipeline$3$1.accept(ReferencePipeline.java:195)
[2025-02-06T15:05:26.184Z] at java.base/java.util.ArrayList$ArrayListSpliterator.forEachRemaining(ArrayList.java:1655)
[2025-02-06T15:05:26.184Z] at java.base/java.util.stream.ReferencePipeline$Head.forEach(ReferencePipeline.java:658)
[2025-02-06T15:05:26.184Z] at java.base/java.util.stream.ReferencePipeline$7$1.accept(ReferencePipeline.java:274)
[2025-02-06T15:05:26.185Z] at java.base/java.util.stream.ReferencePipeline$3$1.accept(ReferencePipeline.java:195)
[2025-02-06T15:05:26.185Z] at java.base/java.util.stream.ReferencePipeline$3$1.accept(ReferencePipeline.java:195)
[2025-02-06T15:05:26.185Z] at java.base/java.util.Spliterators$ArraySpliterator.forEachRemaining(Spliterators.java:948)
[2025-02-06T15:05:26.185Z] at java.base/java.util.stream.AbstractPipeline.copyInto(AbstractPipeline.java:484)
[2025-02-06T15:05:26.185Z] at java.base/java.util.stream.AbstractPipeline.wrapAndCopyInto(AbstractPipeline.java:474)
[2025-02-06T15:05:26.185Z] at java.base/java.util.stream.ForEachOps$ForEachOp.evaluateSequential(ForEachOps.java:150)
[2025-02-06T15:05:26.185Z] at java.base/java.util.stream.ForEachOps$ForEachOp$OfRef.evaluateSequential(ForEachOps.java:173)
[2025-02-06T15:05:26.185Z] at java.base/java.util.stream.AbstractPipeline.evaluate(AbstractPipeline.java:234)
[2025-02-06T15:05:26.185Z] at java.base/java.util.stream.ReferencePipeline.forEach(ReferencePipeline.java:497)
[2025-02-06T15:05:26.185Z] at java.base/java.util.stream.ReferencePipeline$7$1.accept(ReferencePipeline.java:274)
[2025-02-06T15:05:26.185Z] at java.base/java.util.stream.ReferencePipeline$3$1.accept(ReferencePipeline.java:195)
[2025-02-06T15:05:26.185Z] at java.base/java.util.stream.ReferencePipeline$3$1.accept(ReferencePipeline.java:195)
[2025-02-06T15:05:26.185Z] at java.base/java.util.stream.ReferencePipeline$3$1.accept(ReferencePipeline.java:195)
[2025-02-06T15:05:26.185Z] at java.base/java.util.ArrayList$ArrayListSpliterator.forEachRemaining(ArrayList.java:1655)
[2025-02-06T15:05:26.185Z] at java.base/java.util.stream.AbstractPipeline.copyInto(AbstractPipeline.java:484)
[2025-02-06T15:05:26.185Z] at java.base/java.util.stream.AbstractPipeline.wrapAndCopyInto(AbstractPipeline.java:474)
[2025-02-06T15:05:26.185Z] at java.base/java.util.stream.ForEachOps$ForEachOp.evaluateSequential(ForEachOps.java:150)
[2025-02-06T15:05:26.185Z] at java.base/java.util.stream.ForEachOps$ForEachOp$OfRef.evaluateSequential(ForEachOps.java:173)
[2025-02-06T15:05:26.185Z] at java.base/java.util.stream.AbstractPipeline.evaluate(AbstractPipeline.java:234)
[2025-02-06T15:05:26.185Z] at java.base/java.util.stream.ReferencePipeline.forEach(ReferencePipeline.java:497)
[2025-02-06T15:05:26.185Z] at java.base/java.util.stream.ReferencePipeline$7$1.accept(ReferencePipeline.java:274)
[2025-02-06T15:05:26.185Z] at java.base/java.util.ArrayList$ArrayListSpliterator.forEachRemaining(ArrayList.java:1655)
[2025-02-06T15:05:26.185Z] at java.base/java.util.stream.AbstractPipeline.copyInto(AbstractPipeline.java:484)
[2025-02-06T15:05:26.185Z] at java.base/java.util.stream.AbstractPipeline.wrapAndCopyInto(AbstractPipeline.java:474)
[2025-02-06T15:05:26.185Z] at java.base/java.util.stream.ForEachOps$ForEachOp.evaluateSequential(ForEachOps.java:150)
[2025-02-06T15:05:26.185Z] at java.base/java.util.stream.ForEachOps$ForEachOp$OfRef.evaluateSequential(ForEachOps.java:173)
[2025-02-06T15:05:26.185Z] at java.base/java.util.stream.AbstractPipeline.evaluate(AbstractPipeline.java:234)
[2025-02-06T15:05:26.185Z] at java.base/java.util.stream.ReferencePipeline.forEach(ReferencePipeline.java:497)
[2025-02-06T15:05:26.185Z] at org.junit.jupiter.engine.descriptor.TestTemplateTestDescriptor.execute(TestTemplateTestDescriptor.java:110)
[2025-02-06T15:05:26.185Z] at org.junit.jupiter.engine.descriptor.TestTemplateTestDescriptor.execute(TestTemplateTestDescriptor.java:44)
[2025-02-06T15:05:26.185Z] at org.junit.platform.engine.support.hierarchical.NodeTestTask.lambda$executeRecursively$6(NodeTestTask.java:151)
[2025-02-06T15:05:26.185Z] at org.junit.platform.engine.support.hierarchical.ThrowableCollector.execute(ThrowableCollector.java:73)
[2025-02-06T15:05:26.185Z] at org.junit.platform.engine.support.hierarchical.NodeTestTask.lambda$executeRecursively$8(NodeTestTask.java:141)
[2025-02-06T15:05:26.185Z] at org.junit.platform.engine.support.hierarchical.Node.around(Node.java:137)
[2025-02-06T15:05:26.185Z] at org.junit.platform.engine.support.hierarchical.NodeTestTask.lambda$executeRecursively$9(NodeTestTask.java:139)
[2025-02-06T15:05:26.185Z] at org.junit.platform.engine.support.hierarchical.ThrowableCollector.execute(ThrowableCollector.java:73)
[2025-02-06T15:05:26.185Z] at org.junit.platform.engine.support.hierarchical.NodeTestTask.executeRecursively(NodeTestTask.java:138)
[2025-02-06T15:05:26.185Z] at org.junit.platform.engine.support.hierarchical.NodeTestTask.execute(NodeTestTask.java:95)
[2025-02-06T15:05:26.185Z] at java.base/java.util.ArrayList.forEach(ArrayList.java:1541)
[2025-02-06T15:05:26.185Z] at org.junit.platform.engine.support.hierarchical.SameThreadHierarchicalTestExecutorService.invokeAll(SameThreadHierarchicalTestExecutorService.java:41)
[2025-02-06T15:05:26.185Z] at org.junit.platform.engine.support.hierarchical.NodeTestTask.lambda$executeRecursively$6(NodeTestTask.java:155)
[2025-02-06T15:05:26.185Z] at org.junit.platform.engine.support.hierarchical.ThrowableCollector.execute(ThrowableCollector.java:73)
[2025-02-06T15:05:26.185Z] at org.junit.platform.engine.support.hierarchical.NodeTestTask.lambda$executeRecursively$8(NodeTestTask.java:141)
[2025-02-06T15:05:26.185Z] at org.junit.platform.engine.support.hierarchical.Node.around(Node.java:137)
[2025-02-06T15:05:26.185Z] at org.junit.platform.engine.support.hierarchical.NodeTestTask.lambda$executeRecursively$9(NodeTestTask.java:139)
[2025-02-06T15:05:26.185Z] at org.junit.platform.engine.support.hierarchical.ThrowableCollector.execute(ThrowableCollector.java:73)
[2025-02-06T15:05:26.185Z] at org.junit.platform.engine.support.hierarchical.NodeTestTask.executeRecursively(NodeTestTask.java:138)
[2025-02-06T15:05:26.185Z] at org.junit.platform.engine.support.hierarchical.NodeTestTask.execute(NodeTestTask.java:95)
[2025-02-06T15:05:26.185Z] at java.base/java.util.ArrayList.forEach(ArrayList.java:1541)
[2025-02-06T15:05:26.185Z] at org.junit.platform.engine.support.hierarchical.SameThreadHierarchicalTestExecutorService.invokeAll(SameThreadHierarchicalTestExecutorService.java:41)
[2025-02-06T15:05:26.185Z] at org.junit.platform.engine.support.hierarchical.NodeTestTask.lambda$executeRecursively$6(NodeTestTask.java:155)
[2025-02-06T15:05:26.185Z] at org.junit.platform.engine.support.hierarchical.ThrowableCollector.execute(ThrowableCollector.java:73)
[2025-02-06T15:05:26.185Z] at org.junit.platform.engine.support.hierarchical.NodeTestTask.lambda$executeRecursively$8(NodeTestTask.java:141)
[2025-02-06T15:05:26.185Z] at org.junit.platform.engine.support.hierarchical.Node.around(Node.java:137)
[2025-02-06T15:05:26.185Z] at org.junit.platform.engine.support.hierarchical.NodeTestTask.lambda$executeRecursively$9(NodeTestTask.java:139)
[2025-02-06T15:05:26.185Z] at org.junit.platform.engine.support.hierarchical.ThrowableCollector.execute(ThrowableCollector.java:73)
[2025-02-06T15:05:26.185Z] at org.junit.platform.engine.support.hierarchical.NodeTestTask.executeRecursively(NodeTestTask.java:138)
[2025-02-06T15:05:26.185Z] at org.junit.platform.engine.support.hierarchical.NodeTestTask.execute(NodeTestTask.java:95)
[2025-02-06T15:05:26.185Z] at org.junit.platform.engine.support.hierarchical.SameThreadHierarchicalTestExecutorService.submit(SameThreadHierarchicalTestExecutorService.java:35)
[2025-02-06T15:05:26.185Z] at org.junit.platform.engine.support.hierarchical.HierarchicalTestExecutor.execute(HierarchicalTestExecutor.java:57)
[2025-02-06T15:05:26.185Z] at org.junit.platform.engine.support.hierarchical.HierarchicalTestEngine.execute(HierarchicalTestEngine.java:54)
[2025-02-06T15:05:26.185Z] at org.junit.platform.launcher.core.EngineExecutionOrchestrator.execute(EngineExecutionOrchestrator.java:147)
[2025-02-06T15:05:26.185Z] at org.junit.platform.launcher.core.EngineExecutionOrchestrator.execute(EngineExecutionOrchestrator.java:127)
[2025-02-06T15:05:26.185Z] at org.junit.platform.launcher.core.EngineExecutionOrchestrator.execute(EngineExecutionOrchestrator.java:90)
[2025-02-06T15:05:26.185Z] at org.junit.platform.launcher.core.EngineExecutionOrchestrator.lambda$execute$0(EngineExecutionOrchestrator.java:55)
[2025-02-06T15:05:26.185Z] at org.junit.platform.launcher.core.EngineExecutionOrchestrator.withInterceptedStreams(EngineExecutionOrchestrator.java:102)
[2025-02-06T15:05:26.185Z] at org.junit.platform.launcher.core.EngineExecutionOrchestrator.execute(EngineExecutionOrchestrator.java:54)
[2025-02-06T15:05:26.185Z] at org.junit.platform.launcher.core.DefaultLauncher.execute(DefaultLauncher.java:114)
[2025-02-06T15:05:26.185Z] at org.junit.platform.launcher.core.DefaultLauncher.execute(DefaultLauncher.java:86)
[2025-02-06T15:05:26.185Z] at org.junit.platform.launcher.core.DefaultLauncherSession$DelegatingLauncher.execute(DefaultLauncherSession.java:86)
[2025-02-06T15:05:26.185Z] at com.sun.javatest.regtest.agent.JUnitRunner.runWithJUnitPlatform(JUnitRunner.java:142)
[2025-02-06T15:05:26.185Z] at com.sun.javatest.regtest.agent.JUnitRunner.main(JUnitRunner.java:95)
[2025-02-06T15:05:26.185Z] at com.sun.javatest.regtest.agent.JUnitRunner.main(JUnitRunner.java:61)
[2025-02-06T15:05:26.185Z] at java.base/jdk.internal.reflect.NativeMethodAccessorImpl.invoke0(Native Method)
[2025-02-06T15:05:26.185Z] at java.base/jdk.internal.reflect.NativeMethodAccessorImpl.invoke(NativeMethodAccessorImpl.java:62)
[2025-02-06T15:05:26.185Z] at java.base/jdk.internal.reflect.DelegatingMethodAccessorImpl.invoke(DelegatingMethodAccessorImpl.java:43)
[2025-02-06T15:05:26.185Z] at java.base/java.lang.reflect.Method.invoke(Method.java:566)
[2025-02-06T15:05:26.185Z] at com.sun.javatest.regtest.agent.MainWrapper$MainTask.run(MainWrapper.java:138)
[2025-02-06T15:05:26.185Z] at java.base/java.lang.Thread.run(Thread.java:829)
[2025-02-06T15:05:26.185Z] Caused by: java.net.ConnectException: Connection refused
[2025-02-06T15:05:26.185Z] at java.base/sun.nio.ch.SocketChannelImpl.checkConnect(Native Method)
[2025-02-06T15:05:26.185Z] at java.base/sun.nio.ch.SocketChannelImpl.finishConnect(SocketChannelImpl.java:777)
[2025-02-06T15:05:26.185Z] at java.net.http/jdk.internal.net.http.PlainHttpConnection$ConnectEvent.handle(PlainHttpConnection.java:128)
[2025-02-06T15:05:26.185Z] at java.net.http/jdk.internal.net.http.HttpClientImpl$SelectorManager.handleEvent(HttpClientImpl.java:962)
[2025-02-06T15:05:26.185Z] at java.net.http/jdk.internal.net.http.HttpClientImpl$SelectorManager.lambda$run$3(HttpClientImpl.java:917)
[2025-02-06T15:05:26.185Z] at java.base/java.util.ArrayList.forEach(ArrayList.java:1541)
[2025-02-06T15:05:26.185Z] at java.net.http/jdk.internal.net.http.HttpClientImpl$SelectorManager.run(HttpClientImpl.java:917)
[2025-02-06T15:05:26.185Z] FAILED ConnectionReuseTest::testConnReuse '[2] http://localhost:44795/'
[2025-02-06T15:05:26.185Z] STARTED ConnectionReuseTest::testConnReuse '[3] http://[::1]:44795/'
[2025-02-06T15:05:26.185Z] TestServer: New connection from Socket[addr=/0:0:0:0:0:0:0:1,port=45222,localport=44795]
[2025-02-06T15:05:26.185Z] TestServer: GET /
[2025-02-06T15:05:26.185Z] Server: creating input stream for stream 1
[2025-02-06T15:05:26.185Z] Using handler for: /
[2025-02-06T15:05:26.185Z] Sent response headers 200
[2025-02-06T15:05:26.185Z] TestServer: GET /
[2025-02-06T15:05:26.185Z] Server: got END_STREAM for stream 3
[2025-02-06T15:05:26.185Z] Using handler for: /
[2025-02-06T15:05:26.185Z] Sent response headers 200
[2025-02-06T15:05:26.185Z] TestServer: GET /
[2025-02-06T15:05:26.185Z] Server: got END_STREAM for stream 5
[2025-02-06T15:05:26.185Z] Using handler for: /
[2025-02-06T15:05:26.185Z] Sent response headers 200
[2025-02-06T15:05:26.185Z] TestServer: GET /
[2025-02-06T15:05:26.185Z] Server: got END_STREAM for stream 7
[2025-02-06T15:05:26.185Z] Using handler for: /
[2025-02-06T15:05:26.185Z] Sent response headers 200
[2025-02-06T15:05:26.185Z] TestServer: GET /
[2025-02-06T15:05:26.185Z] Server: got END_STREAM for stream 9
[2025-02-06T15:05:26.185Z] Using handler for: /
[2025-02-06T15:05:26.185Z] Sent response headers 200
[2025-02-06T15:05:26.185Z] SUCCESSFUL ConnectionReuseTest::testConnReuse '[3] http://[::1]:44795/'
[2025-02-06T15:05:26.185Z] Server stopping 0 connections
[2025-02-06T15:05:26.185Z] Server stopping 1 connections
[2025-02-06T15:05:26.185Z] Server connection to /0:0:0:0:0:0:0:1:45222 stopping. 5 streams
[2025-02-06T15:05:26.185Z] TestServer: Connection writer stopping
[2025-02-06T15:05:26.185Z] JavaTest Message: JUnit Platform Failure(s): 2
[2025-02-06T15:05:26.185Z]
[2025-02-06T15:05:26.185Z] [ JUnit Containers: found 5, started 5, succeeded 5, failed 0, aborted 0, skipped 0]
[2025-02-06T15:05:26.185Z] [ JUnit Tests: found 3, started 3, succeeded 1, failed 2, aborted 0, skipped 0]
[2025-02-06T15:05:26.185Z]
[2025-02-06T15:05:26.185Z] java.lang.Exception: JUnit test failure
[2025-02-06T15:05:26.185Z] at com.sun.javatest.regtest.agent.JUnitRunner.runWithJUnitPlatform(JUnitRunner.java:149)
[2025-02-06T15:05:26.185Z] at com.sun.javatest.regtest.agent.JUnitRunner.main(JUnitRunner.java:95)
[2025-02-06T15:05:26.185Z] at com.sun.javatest.regtest.agent.JUnitRunner.main(JUnitRunner.java:61)
[2025-02-06T15:05:26.185Z] at java.base/jdk.internal.reflect.NativeMethodAccessorImpl.invoke0(Native Method)
[2025-02-06T15:05:26.185Z] at java.base/jdk.internal.reflect.NativeMethodAccessorImpl.invoke(NativeMethodAccessorImpl.java:62)
[2025-02-06T15:05:26.185Z] at java.base/jdk.internal.reflect.DelegatingMethodAccessorImpl.invoke(DelegatingMethodAccessorImpl.java:43)
[2025-02-06T15:05:26.185Z] at java.base/java.lang.reflect.Method.invoke(Method.java:566)
[2025-02-06T15:05:26.185Z] at com.sun.javatest.regtest.agent.MainWrapper$MainTask.run(MainWrapper.java:138)
[2025-02-06T15:05:26.185Z] at java.base/java.lang.Thread.run(Thread.java:829)
[2025-02-06T15:05:26.185Z]
[2025-02-06T15:05:26.185Z] JavaTest Message: Test threw exception: java.lang.Exception: JUnit test failure
[2025-02-06T15:05:26.185Z] JavaTest Message: shutting down test
[2025-02-06T15:05:26.185Z]
[2025-02-06T15:05:26.185Z] STATUS:Failed.`main' threw exception: java.lang.Exception: JUnit test failure
[2025-02-06T15:05:26.185Z] rerun:
[2025-02-06T15:05:26.185Z] cd /home/jenkins/workspace/Test_openjdk11_hs_extended.openjdk_s390x_linux_testList_4/aqa-tests/TKG/output_17388506952171/jdk_net_1/work/scratch && \
[2025-02-06T15:05:26.185Z] DBUS_SESSION_BUS_ADDRESS=unix:path=/run/user/1002/bus \
[2025-02-06T15:05:26.185Z] DISPLAY=:0 \
[2025-02-06T15:05:26.185Z] HOME=/home/jenkins \
[2025-02-06T15:05:26.185Z] LANG=C.UTF-8 \
[2025-02-06T15:05:26.185Z] PATH=/bin:/usr/bin:/usr/sbin \
[2025-02-06T15:05:26.185Z] XDG_RUNTIME_DIR=/run/user/1002 \
[2025-02-06T15:05:26.185Z] XDG_SESSION_CLASS=user \
[2025-02-06T15:05:26.185Z] XDG_SESSION_ID=125568 \
[2025-02-06T15:05:26.185Z] XDG_SESSION_TYPE=tty \
[2025-02-06T15:05:26.185Z] CLASSPATH=/home/jenkins/workspace/Test_openjdk11_hs_extended.openjdk_s390x_linux_testList_4/aqa-tests/TKG/output_17388506952171/jdk_net_1/work/classes/java/net/httpclient/http2/ConnectionReuseTest.d:/home/jenkins/workspace/Test_openjdk11_hs_extended.openjdk_s390x_linux_testList_4/aqa-tests/openjdk/openjdk-jdk/test/jdk/java/net/httpclient/http2:/home/jenkins/workspace/Test_openjdk11_hs_extended.openjdk_s390x_linux_testList_4/aqa-tests/TKG/output_17388506952171/jdk_net_1/work/classes/test/lib:/home/jenkins/workspace/Test_openjdk11_hs_extended.openjdk_s390x_linux_testList_4/aqa-tests/openjdk/openjdk-jdk/test/lib:/home/jenkins/workspace/Test_openjdk11_hs_extended.openjdk_s390x_linux_testList_4/aqa-tests/TKG/output_17388506952171/jdk_net_1/work/classes/java/net/httpclient/http2/server:/home/jenkins/workspace/Test_openjdk11_hs_extended.openjdk_s390x_linux_testList_4/aqa-tests/openjdk/openjdk-jdk/test/jdk/java/net/httpclient/http2/server:/home/jenkins/workspace/Test_openjdk11_hs_extended.openjdk_s390x_linux_testList_4/aqa-tests/TKG/output_17388506952171/jdk_net_1/work/classes/java/net/httpclient:/home/jenkins/workspace/Test_openjdk11_hs_extended.openjdk_s390x_linux_testList_4/aqa-tests/openjdk/openjdk-jdk/test/jdk/java/net/httpclient:/home/jenkins/workspace/Test_openjdk11_hs_extended.openjdk_s390x_linux_testList_4/jvmtest/openjdk/jtreg/lib/junit-platform-console-standalone-1.9.2.jar:/home/jenkins/workspace/Test_openjdk11_hs_extended.openjdk_s390x_linux_testList_4/jvmtest/openjdk/jtreg/lib/javatest.jar:/home/jenkins/workspace/Test_openjdk11_hs_extended.openjdk_s390x_linux_testList_4/jvmtest/openjdk/jtreg/lib/jtreg.jar \
[2025-02-06T15:05:26.185Z] /home/jenkins/workspace/Test_openjdk11_hs_extended.openjdk_s390x_linux_testList_4/jdkbinary/j2sdk-image/bin/java \
[2025-02-06T15:05:26.185Z] -Dtest.vm.opts='-ea -esa -Xmx512m -XX:-UseCompressedOops' \
[2025-02-06T15:05:26.185Z] -Dtest.tool.vm.opts='-J-ea -J-esa -J-Xmx512m -J-XX:-UseCompressedOops' \
[2025-02-06T15:05:26.185Z] -Dtest.compiler.opts= \
[2025-02-06T15:05:26.185Z] -Dtest.java.opts= \
[2025-02-06T15:05:26.185Z] -Dtest.jdk=/home/jenkins/workspace/Test_openjdk11_hs_extended.openjdk_s390x_linux_testList_4/jdkbinary/j2sdk-image \
[2025-02-06T15:05:26.185Z] -Dcompile.jdk=/home/jenkins/workspace/Test_openjdk11_hs_extended.openjdk_s390x_linux_testList_4/jdkbinary/j2sdk-image \
[2025-02-06T15:05:26.185Z] -Dtest.timeout.factor=8.0 \
[2025-02-06T15:05:26.185Z] -Dtest.nativepath=/home/jenkins/workspace/Test_openjdk11_hs_extended.openjdk_s390x_linux_testList_4/jdkbinary/openjdk-test-image/jdk/jtreg/native \
[2025-02-06T15:05:26.185Z] -Dtest.root=/home/jenkins/workspace/Test_openjdk11_hs_extended.openjdk_s390x_linux_testList_4/aqa-tests/openjdk/openjdk-jdk/test/jdk \
[2025-02-06T15:05:26.185Z] -Dtest.name=java/net/httpclient/http2/ConnectionReuseTest.java \
[2025-02-06T15:05:26.185Z] -Dtest.file=/home/jenkins/workspace/Test_openjdk11_hs_extended.openjdk_s390x_linux_testList_4/aqa-tests/openjdk/openjdk-jdk/test/jdk/java/net/httpclient/http2/ConnectionReuseTest.java \
[2025-02-06T15:05:26.185Z] -Dtest.src=/home/jenkins/workspace/Test_openjdk11_hs_extended.openjdk_s390x_linux_testList_4/aqa-tests/openjdk/openjdk-jdk/test/jdk/java/net/httpclient/http2 \
[2025-02-06T15:05:26.185Z] -Dtest.src.path=/home/jenkins/workspace/Test_openjdk11_hs_extended.openjdk_s390x_linux_testList_4/aqa-tests/openjdk/openjdk-jdk/test/jdk/java/net/httpclient/http2:/home/jenkins/workspace/Test_openjdk11_hs_extended.openjdk_s390x_linux_testList_4/aqa-tests/openjdk/openjdk-jdk/test/lib:/home/jenkins/workspace/Test_openjdk11_hs_extended.openjdk_s390x_linux_testList_4/aqa-tests/openjdk/openjdk-jdk/test/jdk/java/net/httpclient/http2/server:/home/jenkins/workspace/Test_openjdk11_hs_extended.openjdk_s390x_linux_testList_4/aqa-tests/openjdk/openjdk-jdk/test/jdk/java/net/httpclient \
[2025-02-06T15:05:26.185Z] -Dtest.classes=/home/jenkins/workspace/Test_openjdk11_hs_extended.openjdk_s390x_linux_testList_4/aqa-tests/TKG/output_17388506952171/jdk_net_1/work/classes/java/net/httpclient/http2/ConnectionReuseTest.d \
[2025-02-06T15:05:26.185Z] -Dtest.class.path=/home/jenkins/workspace/Test_openjdk11_hs_extended.openjdk_s390x_linux_testList_4/aqa-tests/TKG/output_17388506952171/jdk_net_1/work/classes/java/net/httpclient/http2/ConnectionReuseTest.d:/home/jenkins/workspace/Test_openjdk11_hs_extended.openjdk_s390x_linux_testList_4/aqa-tests/TKG/output_17388506952171/jdk_net_1/work/classes/test/lib:/home/jenkins/workspace/Test_openjdk11_hs_extended.openjdk_s390x_linux_testList_4/aqa-tests/TKG/output_17388506952171/jdk_net_1/work/classes/java/net/httpclient/http2/server:/home/jenkins/workspace/Test_openjdk11_hs_extended.openjdk_s390x_linux_testList_4/aqa-tests/TKG/output_17388506952171/jdk_net_1/work/classes/java/net/httpclient \
[2025-02-06T15:05:26.185Z] -Dtest.class.path.prefix=/home/jenkins/workspace/Test_openjdk11_hs_extended.openjdk_s390x_linux_testList_4/aqa-tests/TKG/output_17388506952171/jdk_net_1/work/classes/java/net/httpclient/http2/ConnectionReuseTest.d:/home/jenkins/workspace/Test_openjdk11_hs_extended.openjdk_s390x_linux_testList_4/aqa-tests/openjdk/openjdk-jdk/test/jdk/java/net/httpclient/http2:/home/jenkins/workspace/Test_openjdk11_hs_extended.openjdk_s390x_linux_testList_4/aqa-tests/TKG/output_17388506952171/jdk_net_1/work/classes/test/lib:/home/jenkins/workspace/Test_openjdk11_hs_extended.openjdk_s390x_linux_testList_4/aqa-tests/TKG/output_17388506952171/jdk_net_1/work/classes/java/net/httpclient/http2/server:/home/jenkins/workspace/Test_openjdk11_hs_extended.openjdk_s390x_linux_testList_4/aqa-tests/TKG/output_17388506952171/jdk_net_1/work/classes/java/net/httpclient \
[2025-02-06T15:05:26.185Z] -Dtest.modules='java.net.http/jdk.internal.net.http.common java.net.http/jdk.internal.net.http.frame java.net.http/jdk.internal.net.http.hpack java.logging java.base/sun.net.www.http java.base/sun.net.www java.base/sun.net' \
[2025-02-06T15:05:26.185Z] --add-modules java.net.http,java.logging,java.base \
[2025-02-06T15:05:26.185Z] --add-exports java.net.http/jdk.internal.net.http.common=ALL-UNNAMED \
[2025-02-06T15:05:26.185Z] --add-exports java.net.http/jdk.internal.net.http.frame=ALL-UNNAMED \
[2025-02-06T15:05:26.185Z] --add-exports java.net.http/jdk.internal.net.http.hpack=ALL-UNNAMED \
[2025-02-06T15:05:26.185Z] --add-exports java.base/sun.net.www.http=ALL-UNNAMED \
[2025-02-06T15:05:26.185Z] --add-exports java.base/sun.net.www=ALL-UNNAMED \
[2025-02-06T15:05:26.185Z] --add-exports java.base/sun.net=ALL-UNNAMED \
[2025-02-06T15:05:26.185Z] -ea \
[2025-02-06T15:05:26.185Z] -esa \
[2025-02-06T15:05:26.185Z] -Xmx512m \
[2025-02-06T15:05:26.185Z] -XX:-UseCompressedOops \
[2025-02-06T15:05:26.185Z] -Djava.library.path=/home/jenkins/workspace/Test_openjdk11_hs_extended.openjdk_s390x_linux_testList_4/jdkbinary/openjdk-test-image/jdk/jtreg/native \
[2025-02-06T15:05:26.185Z] -Djava.net.preferIPv6Addresses=true \
[2025-02-06T15:05:26.185Z] com.sun.javatest.regtest.agent.MainWrapper /home/jenkins/workspace/Test_openjdk11_hs_extended.openjdk_s390x_linux_testList_4/aqa-tests/TKG/output_17388506952171/jdk_net_1/work/java/net/httpclient/http2/ConnectionReuseTest.d/junit.1.jta java/net/httpclient/http2/ConnectionReuseTest.java ConnectionReuseTest
[2025-02-06T15:05:26.185Z]
[2025-02-06T15:05:26.185Z] TEST RESULT: Failed. Execution failed: `main' threw exception: java.lang.Exception: JUnit test failure
[2025-02-06T15:05:26.185Z] --------------------------------------------------
[2025-02-06T16:28:00.054Z] TEST: java/net/MulticastSocket/SetLoopbackModeIPv4.java
[2025-02-06T16:28:00.054Z] TEST JDK: /home/jenkins/workspace/Test_openjdk11_hs_extended.openjdk_s390x_linux_testList_4/jdkbinary/j2sdk-image
[2025-02-06T16:28:00.054Z]
[2025-02-06T16:28:00.054Z] ACTION: build -- Passed. Build successful
[2025-02-06T16:28:00.054Z] REASON: User specified action: run build jdk.test.lib.NetworkConfiguration jdk.test.lib.Platform SetLoopbackMode SetLoopbackModeIPv4
[2025-02-06T16:28:00.054Z] TIME: 0.08 seconds
[2025-02-06T16:28:00.054Z] messages:
[2025-02-06T16:28:00.054Z] command: build jdk.test.lib.NetworkConfiguration jdk.test.lib.Platform SetLoopbackMode SetLoopbackModeIPv4
[2025-02-06T16:28:00.054Z] reason: User specified action: run build jdk.test.lib.NetworkConfiguration jdk.test.lib.Platform SetLoopbackMode SetLoopbackModeIPv4
[2025-02-06T16:28:00.055Z] started: Thu Feb 06 16:27:46 UTC 2025
[2025-02-06T16:28:00.055Z] Test directory:
[2025-02-06T16:28:00.055Z] compile: SetLoopbackMode, SetLoopbackModeIPv4
[2025-02-06T16:28:00.055Z] finished: Thu Feb 06 16:27:46 UTC 2025
[2025-02-06T16:28:00.055Z] elapsed time (seconds): 0.08
[2025-02-06T16:28:00.055Z]
[2025-02-06T16:28:00.055Z] ACTION: compile -- Passed. Compilation successful
[2025-02-06T16:28:00.055Z] REASON: .class file out of date or does not exist
[2025-02-06T16:28:00.055Z] TIME: 0.08 seconds
[2025-02-06T16:28:00.055Z] messages:
[2025-02-06T16:28:00.055Z] command: compile /home/jenkins/workspace/Test_openjdk11_hs_extended.openjdk_s390x_linux_testList_4/aqa-tests/openjdk/openjdk-jdk/test/jdk/java/net/MulticastSocket/SetLoopbackMode.java /home/jenkins/workspace/Test_openjdk11_hs_extended.openjdk_s390x_linux_testList_4/aqa-tests/openjdk/openjdk-jdk/test/jdk/java/net/MulticastSocket/SetLoopbackModeIPv4.java
[2025-02-06T16:28:00.055Z] reason: .class file out of date or does not exist
[2025-02-06T16:28:00.055Z] started: Thu Feb 06 16:27:46 UTC 2025
[2025-02-06T16:28:00.055Z] Mode: agentvm
[2025-02-06T16:28:00.055Z] Agent id: 1
[2025-02-06T16:28:00.055Z] finished: Thu Feb 06 16:27:46 UTC 2025
[2025-02-06T16:28:00.055Z] elapsed time (seconds): 0.08
[2025-02-06T16:28:00.055Z] configuration:
[2025-02-06T16:28:00.055Z] Boot Layer (javac runtime environment)
[2025-02-06T16:28:00.055Z] class path: /home/jenkins/workspace/Test_openjdk11_hs_extended.openjdk_s390x_linux_testList_4/jvmtest/openjdk/jtreg/lib/javatest.jar
[2025-02-06T16:28:00.055Z] /home/jenkins/workspace/Test_openjdk11_hs_extended.openjdk_s390x_linux_testList_4/jvmtest/openjdk/jtreg/lib/jtreg.jar
[2025-02-06T16:28:00.055Z] patch: java.base /home/jenkins/workspace/Test_openjdk11_hs_extended.openjdk_s390x_linux_testList_4/aqa-tests/TKG/output_17388506952171/jdk_net_1/work/patches/java.base
[2025-02-06T16:28:00.055Z]
[2025-02-06T16:28:00.055Z] javac compilation environment
[2025-02-06T16:28:00.055Z] source path: /home/jenkins/workspace/Test_openjdk11_hs_extended.openjdk_s390x_linux_testList_4/aqa-tests/openjdk/openjdk-jdk/test/jdk/java/net/MulticastSocket
[2025-02-06T16:28:00.055Z] /home/jenkins/workspace/Test_openjdk11_hs_extended.openjdk_s390x_linux_testList_4/aqa-tests/openjdk/openjdk-jdk/test/lib
[2025-02-06T16:28:00.055Z] class path: /home/jenkins/workspace/Test_openjdk11_hs_extended.openjdk_s390x_linux_testList_4/aqa-tests/openjdk/openjdk-jdk/test/jdk/java/net/MulticastSocket
[2025-02-06T16:28:00.055Z] /home/jenkins/workspace/Test_openjdk11_hs_extended.openjdk_s390x_linux_testList_4/aqa-tests/TKG/output_17388506952171/jdk_net_1/work/classes/java/net/MulticastSocket/SetLoopbackModeIPv4.d
[2025-02-06T16:28:00.055Z] /home/jenkins/workspace/Test_openjdk11_hs_extended.openjdk_s390x_linux_testList_4/aqa-tests/TKG/output_17388506952171/jdk_net_1/work/classes/test/lib
[2025-02-06T16:28:00.055Z]
[2025-02-06T16:28:00.055Z] rerun:
[2025-02-06T16:28:00.055Z] cd /home/jenkins/workspace/Test_openjdk11_hs_extended.openjdk_s390x_linux_testList_4/aqa-tests/TKG/output_17388506952171/jdk_net_1/work/scratch && \
[2025-02-06T16:28:00.055Z] DBUS_SESSION_BUS_ADDRESS=unix:path=/run/user/1002/bus \
[2025-02-06T16:28:00.055Z] DISPLAY=:0 \
[2025-02-06T16:28:00.055Z] HOME=/home/jenkins \
[2025-02-06T16:28:00.055Z] LANG=C.UTF-8 \
[2025-02-06T16:28:00.055Z] PATH=/bin:/usr/bin:/usr/sbin \
[2025-02-06T16:28:00.055Z] XDG_RUNTIME_DIR=/run/user/1002 \
[2025-02-06T16:28:00.055Z] XDG_SESSION_CLASS=user \
[2025-02-06T16:28:00.055Z] XDG_SESSION_ID=125568 \
[2025-02-06T16:28:00.055Z] XDG_SESSION_TYPE=tty \
[2025-02-06T16:28:00.055Z] /home/jenkins/workspace/Test_openjdk11_hs_extended.openjdk_s390x_linux_testList_4/jdkbinary/j2sdk-image/bin/javac \
[2025-02-06T16:28:00.055Z] -J-ea \
[2025-02-06T16:28:00.055Z] -J-esa \
[2025-02-06T16:28:00.055Z] -J-Xmx512m \
[2025-02-06T16:28:00.055Z] -J-XX:-UseCompressedOops \
[2025-02-06T16:28:00.055Z] -J-Dtest.vm.opts='-ea -esa -Xmx512m -XX:-UseCompressedOops' \
[2025-02-06T16:28:00.055Z] -J-Dtest.tool.vm.opts='-J-ea -J-esa -J-Xmx512m -J-XX:-UseCompressedOops' \
[2025-02-06T16:28:00.055Z] -J-Dtest.compiler.opts= \
[2025-02-06T16:28:00.055Z] -J-Dtest.java.opts= \
[2025-02-06T16:28:00.055Z] -J-Dtest.jdk=/home/jenkins/workspace/Test_openjdk11_hs_extended.openjdk_s390x_linux_testList_4/jdkbinary/j2sdk-image \
[2025-02-06T16:28:00.055Z] -J-Dcompile.jdk=/home/jenkins/workspace/Test_openjdk11_hs_extended.openjdk_s390x_linux_testList_4/jdkbinary/j2sdk-image \
[2025-02-06T16:28:00.055Z] -J-Dtest.timeout.factor=8.0 \
[2025-02-06T16:28:00.055Z] -J-Dtest.nativepath=/home/jenkins/workspace/Test_openjdk11_hs_extended.openjdk_s390x_linux_testList_4/jdkbinary/openjdk-test-image/jdk/jtreg/native \
[2025-02-06T16:28:00.055Z] -J-Dtest.root=/home/jenkins/workspace/Test_openjdk11_hs_extended.openjdk_s390x_linux_testList_4/aqa-tests/openjdk/openjdk-jdk/test/jdk \
[2025-02-06T16:28:00.055Z] -J-Dtest.name=java/net/MulticastSocket/SetLoopbackModeIPv4.java \
[2025-02-06T16:28:00.055Z] -J-Dtest.file=/home/jenkins/workspace/Test_openjdk11_hs_extended.openjdk_s390x_linux_testList_4/aqa-tests/openjdk/openjdk-jdk/test/jdk/java/net/MulticastSocket/SetLoopbackModeIPv4.java \
[2025-02-06T16:28:00.055Z] -J-Dtest.src=/home/jenkins/workspace/Test_openjdk11_hs_extended.openjdk_s390x_linux_testList_4/aqa-tests/openjdk/openjdk-jdk/test/jdk/java/net/MulticastSocket \
[2025-02-06T16:28:00.055Z] -J-Dtest.src.path=/home/jenkins/workspace/Test_openjdk11_hs_extended.openjdk_s390x_linux_testList_4/aqa-tests/openjdk/openjdk-jdk/test/jdk/java/net/MulticastSocket:/home/jenkins/workspace/Test_openjdk11_hs_extended.openjdk_s390x_linux_testList_4/aqa-tests/openjdk/openjdk-jdk/test/lib \
[2025-02-06T16:28:00.055Z] -J-Dtest.classes=/home/jenkins/workspace/Test_openjdk11_hs_extended.openjdk_s390x_linux_testList_4/aqa-tests/TKG/output_17388506952171/jdk_net_1/work/classes/java/net/MulticastSocket/SetLoopbackModeIPv4.d \
[2025-02-06T16:28:00.055Z] -J-Dtest.class.path=/home/jenkins/workspace/Test_openjdk11_hs_extended.openjdk_s390x_linux_testList_4/aqa-tests/TKG/output_17388506952171/jdk_net_1/work/classes/java/net/MulticastSocket/SetLoopbackModeIPv4.d:/home/jenkins/workspace/Test_openjdk11_hs_extended.openjdk_s390x_linux_testList_4/aqa-tests/TKG/output_17388506952171/jdk_net_1/work/classes/test/lib \
[2025-02-06T16:28:00.055Z] -J-Dtest.class.path.prefix=/home/jenkins/workspace/Test_openjdk11_hs_extended.openjdk_s390x_linux_testList_4/aqa-tests/TKG/output_17388506952171/jdk_net_1/work/classes/java/net/MulticastSocket/SetLoopbackModeIPv4.d:/home/jenkins/workspace/Test_openjdk11_hs_extended.openjdk_s390x_linux_testList_4/aqa-tests/openjdk/openjdk-jdk/test/jdk/java/net/MulticastSocket:/home/jenkins/workspace/Test_openjdk11_hs_extended.openjdk_s390x_linux_testList_4/aqa-tests/TKG/output_17388506952171/jdk_net_1/work/classes/test/lib \
[2025-02-06T16:28:00.055Z] -d /home/jenkins/workspace/Test_openjdk11_hs_extended.openjdk_s390x_linux_testList_4/aqa-tests/TKG/output_17388506952171/jdk_net_1/work/classes/java/net/MulticastSocket/SetLoopbackModeIPv4.d \
[2025-02-06T16:28:00.055Z] -sourcepath /home/jenkins/workspace/Test_openjdk11_hs_extended.openjdk_s390x_linux_testList_4/aqa-tests/openjdk/openjdk-jdk/test/jdk/java/net/MulticastSocket:/home/jenkins/workspace/Test_openjdk11_hs_extended.openjdk_s390x_linux_testList_4/aqa-tests/openjdk/openjdk-jdk/test/lib \
[2025-02-06T16:28:00.055Z] -classpath /home/jenkins/workspace/Test_openjdk11_hs_extended.openjdk_s390x_linux_testList_4/aqa-tests/openjdk/openjdk-jdk/test/jdk/java/net/MulticastSocket:/home/jenkins/workspace/Test_openjdk11_hs_extended.openjdk_s390x_linux_testList_4/aqa-tests/TKG/output_17388506952171/jdk_net_1/work/classes/java/net/MulticastSocket/SetLoopbackModeIPv4.d:/home/jenkins/workspace/Test_openjdk11_hs_extended.openjdk_s390x_linux_testList_4/aqa-tests/TKG/output_17388506952171/jdk_net_1/work/classes/test/lib /home/jenkins/workspace/Test_openjdk11_hs_extended.openjdk_s390x_linux_testList_4/aqa-tests/openjdk/openjdk-jdk/test/jdk/java/net/MulticastSocket/SetLoopbackMode.java /home/jenkins/workspace/Test_openjdk11_hs_extended.openjdk_s390x_linux_testList_4/aqa-tests/openjdk/openjdk-jdk/test/jdk/java/net/MulticastSocket/SetLoopbackModeIPv4.java
[2025-02-06T16:28:00.055Z]
[2025-02-06T16:28:00.055Z] ACTION: build -- Passed. All files up to date
[2025-02-06T16:28:00.055Z] REASON: Named class compiled on demand
[2025-02-06T16:28:00.055Z] TIME: 0.0 seconds
[2025-02-06T16:28:00.055Z] messages:
[2025-02-06T16:28:00.055Z] command: build SetLoopbackModeIPv4
[2025-02-06T16:28:00.055Z] reason: Named class compiled on demand
[2025-02-06T16:28:00.055Z] started: Thu Feb 06 16:27:46 UTC 2025
[2025-02-06T16:28:00.055Z] finished: Thu Feb 06 16:27:46 UTC 2025
[2025-02-06T16:28:00.055Z] elapsed time (seconds): 0.0
[2025-02-06T16:28:00.055Z]
[2025-02-06T16:28:00.055Z] ACTION: main -- Failed. Execution failed: `main' threw exception: java.lang.RuntimeException: Test failed
[2025-02-06T16:28:00.055Z] REASON: User specified action: run main/othervm -Djava.net.preferIPv4Stack=true SetLoopbackModeIPv4
[2025-02-06T16:28:00.055Z] TIME: 2.819 seconds
[2025-02-06T16:28:00.055Z] messages:
[2025-02-06T16:28:00.055Z] command: main -Djava.net.preferIPv4Stack=true SetLoopbackModeIPv4
[2025-02-06T16:28:00.055Z] reason: User specified action: run main/othervm -Djava.net.preferIPv4Stack=true SetLoopbackModeIPv4
[2025-02-06T16:28:00.055Z] started: Thu Feb 06 16:27:46 UTC 2025
[2025-02-06T16:28:00.055Z] Mode: othervm [/othervm specified]
[2025-02-06T16:28:00.055Z] finished: Thu Feb 06 16:27:49 UTC 2025
[2025-02-06T16:28:00.055Z] elapsed time (seconds): 2.819
[2025-02-06T16:28:00.055Z] configuration:
[2025-02-06T16:28:00.055Z] STDOUT:
[2025-02-06T16:28:00.055Z]
[2025-02-06T16:28:00.055Z] Test will use multicast group: /224.80.80.80
[2025-02-06T16:28:00.055Z]
[2025-02-06T16:28:00.055Z] ******************
[2025-02-06T16:28:00.055Z]
[2025-02-06T16:28:00.055Z] Loopback mode is disabled.
[2025-02-06T16:28:00.055Z] Packet not received - correct.
[2025-02-06T16:28:00.055Z]
[2025-02-06T16:28:00.055Z] ******************
[2025-02-06T16:28:00.055Z]
[2025-02-06T16:28:00.055Z] Loopback mode is enabled.
[2025-02-06T16:28:00.055Z] Packet not received (packet excepted as loopback is enabled)
[2025-02-06T16:28:00.055Z]
[2025-02-06T16:28:00.055Z] ******************
[2025-02-06T16:28:00.055Z]
[2025-02-06T16:28:00.055Z] STDERR:
[2025-02-06T16:28:00.055Z] java.lang.RuntimeException: Test failed
[2025-02-06T16:28:00.055Z] at SetLoopbackMode.main(SetLoopbackMode.java:133)
[2025-02-06T16:28:00.055Z] at SetLoopbackModeIPv4.main(SetLoopbackModeIPv4.java:41)
[2025-02-06T16:28:00.055Z] at java.base/jdk.internal.reflect.NativeMethodAccessorImpl.invoke0(Native Method)
[2025-02-06T16:28:00.056Z] at java.base/jdk.internal.reflect.NativeMethodAccessorImpl.invoke(NativeMethodAccessorImpl.java:62)
[2025-02-06T16:28:00.056Z] at java.base/jdk.internal.reflect.DelegatingMethodAccessorImpl.invoke(DelegatingMethodAccessorImpl.java:43)
[2025-02-06T16:28:00.056Z] at java.base/java.lang.reflect.Method.invoke(Method.java:566)
[2025-02-06T16:28:00.056Z] at com.sun.javatest.regtest.agent.MainWrapper$MainTask.run(MainWrapper.java:138)
[2025-02-06T16:28:00.056Z] at java.base/java.lang.Thread.run(Thread.java:829)
[2025-02-06T16:28:00.056Z]
[2025-02-06T16:28:00.056Z] JavaTest Message: Test threw exception: java.lang.RuntimeException: Test failed
[2025-02-06T16:28:00.056Z] JavaTest Message: shutting down test
[2025-02-06T16:28:00.056Z]
[2025-02-06T16:28:00.056Z] STATUS:Failed.`main' threw exception: java.lang.RuntimeException: Test failed
[2025-02-06T16:28:00.056Z] rerun:
[2025-02-06T16:28:00.056Z] cd /home/jenkins/workspace/Test_openjdk11_hs_extended.openjdk_s390x_linux_testList_4/aqa-tests/TKG/output_17388506952171/jdk_net_1/work/scratch && \
[2025-02-06T16:28:00.056Z] DBUS_SESSION_BUS_ADDRESS=unix:path=/run/user/1002/bus \
[2025-02-06T16:28:00.056Z] DISPLAY=:0 \
[2025-02-06T16:28:00.056Z] HOME=/home/jenkins \
[2025-02-06T16:28:00.056Z] LANG=C.UTF-8 \
[2025-02-06T16:28:00.056Z] PATH=/bin:/usr/bin:/usr/sbin \
[2025-02-06T16:28:00.056Z] XDG_RUNTIME_DIR=/run/user/1002 \
[2025-02-06T16:28:00.056Z] XDG_SESSION_CLASS=user \
[2025-02-06T16:28:00.056Z] XDG_SESSION_ID=125568 \
[2025-02-06T16:28:00.056Z] XDG_SESSION_TYPE=tty \
[2025-02-06T16:28:00.056Z] CLASSPATH=/home/jenkins/workspace/Test_openjdk11_hs_extended.openjdk_s390x_linux_testList_4/aqa-tests/TKG/output_17388506952171/jdk_net_1/work/classes/java/net/MulticastSocket/SetLoopbackModeIPv4.d:/home/jenkins/workspace/Test_openjdk11_hs_extended.openjdk_s390x_linux_testList_4/aqa-tests/openjdk/openjdk-jdk/test/jdk/java/net/MulticastSocket:/home/jenkins/workspace/Test_openjdk11_hs_extended.openjdk_s390x_linux_testList_4/aqa-tests/TKG/output_17388506952171/jdk_net_1/work/classes/test/lib:/home/jenkins/workspace/Test_openjdk11_hs_extended.openjdk_s390x_linux_testList_4/aqa-tests/openjdk/openjdk-jdk/test/lib:/home/jenkins/workspace/Test_openjdk11_hs_extended.openjdk_s390x_linux_testList_4/jvmtest/openjdk/jtreg/lib/javatest.jar:/home/jenkins/workspace/Test_openjdk11_hs_extended.openjdk_s390x_linux_testList_4/jvmtest/openjdk/jtreg/lib/jtreg.jar \
[2025-02-06T16:28:00.056Z] /home/jenkins/workspace/Test_openjdk11_hs_extended.openjdk_s390x_linux_testList_4/jdkbinary/j2sdk-image/bin/java \
[2025-02-06T16:28:00.056Z] -Dtest.vm.opts='-ea -esa -Xmx512m -XX:-UseCompressedOops' \
[2025-02-06T16:28:00.056Z] -Dtest.tool.vm.opts='-J-ea -J-esa -J-Xmx512m -J-XX:-UseCompressedOops' \
[2025-02-06T16:28:00.056Z] -Dtest.compiler.opts= \
[2025-02-06T16:28:00.056Z] -Dtest.java.opts= \
[2025-02-06T16:28:00.056Z] -Dtest.jdk=/home/jenkins/workspace/Test_openjdk11_hs_extended.openjdk_s390x_linux_testList_4/jdkbinary/j2sdk-image \
[2025-02-06T16:28:00.056Z] -Dcompile.jdk=/home/jenkins/workspace/Test_openjdk11_hs_extended.openjdk_s390x_linux_testList_4/jdkbinary/j2sdk-image \
[2025-02-06T16:28:00.056Z] -Dtest.timeout.factor=8.0 \
[2025-02-06T16:28:00.056Z] -Dtest.nativepath=/home/jenkins/workspace/Test_openjdk11_hs_extended.openjdk_s390x_linux_testList_4/jdkbinary/openjdk-test-image/jdk/jtreg/native \
[2025-02-06T16:28:00.056Z] -Dtest.root=/home/jenkins/workspace/Test_openjdk11_hs_extended.openjdk_s390x_linux_testList_4/aqa-tests/openjdk/openjdk-jdk/test/jdk \
[2025-02-06T16:28:00.056Z] -Dtest.name=java/net/MulticastSocket/SetLoopbackModeIPv4.java \
[2025-02-06T16:28:00.056Z] -Dtest.file=/home/jenkins/workspace/Test_openjdk11_hs_extended.openjdk_s390x_linux_testList_4/aqa-tests/openjdk/openjdk-jdk/test/jdk/java/net/MulticastSocket/SetLoopbackModeIPv4.java \
[2025-02-06T16:28:00.056Z] -Dtest.src=/home/jenkins/workspace/Test_openjdk11_hs_extended.openjdk_s390x_linux_testList_4/aqa-tests/openjdk/openjdk-jdk/test/jdk/java/net/MulticastSocket \
[2025-02-06T16:28:00.056Z] -Dtest.src.path=/home/jenkins/workspace/Test_openjdk11_hs_extended.openjdk_s390x_linux_testList_4/aqa-tests/openjdk/openjdk-jdk/test/jdk/java/net/MulticastSocket:/home/jenkins/workspace/Test_openjdk11_hs_extended.openjdk_s390x_linux_testList_4/aqa-tests/openjdk/openjdk-jdk/test/lib \
[2025-02-06T16:28:00.056Z] -Dtest.classes=/home/jenkins/workspace/Test_openjdk11_hs_extended.openjdk_s390x_linux_testList_4/aqa-tests/TKG/output_17388506952171/jdk_net_1/work/classes/java/net/MulticastSocket/SetLoopbackModeIPv4.d \
[2025-02-06T16:28:00.056Z] -Dtest.class.path=/home/jenkins/workspace/Test_openjdk11_hs_extended.openjdk_s390x_linux_testList_4/aqa-tests/TKG/output_17388506952171/jdk_net_1/work/classes/java/net/MulticastSocket/SetLoopbackModeIPv4.d:/home/jenkins/workspace/Test_openjdk11_hs_extended.openjdk_s390x_linux_testList_4/aqa-tests/TKG/output_17388506952171/jdk_net_1/work/classes/test/lib \
[2025-02-06T16:28:00.056Z] -Dtest.class.path.prefix=/home/jenkins/workspace/Test_openjdk11_hs_extended.openjdk_s390x_linux_testList_4/aqa-tests/TKG/output_17388506952171/jdk_net_1/work/classes/java/net/MulticastSocket/SetLoopbackModeIPv4.d:/home/jenkins/workspace/Test_openjdk11_hs_extended.openjdk_s390x_linux_testList_4/aqa-tests/openjdk/openjdk-jdk/test/jdk/java/net/MulticastSocket:/home/jenkins/workspace/Test_openjdk11_hs_extended.openjdk_s390x_linux_testList_4/aqa-tests/TKG/output_17388506952171/jdk_net_1/work/classes/test/lib \
[2025-02-06T16:28:00.056Z] -ea \
[2025-02-06T16:28:00.056Z] -esa \
[2025-02-06T16:28:00.056Z] -Xmx512m \
[2025-02-06T16:28:00.056Z] -XX:-UseCompressedOops \
[2025-02-06T16:28:00.056Z] -Djava.library.path=/home/jenkins/workspace/Test_openjdk11_hs_extended.openjdk_s390x_linux_testList_4/jdkbinary/openjdk-test-image/jdk/jtreg/native \
[2025-02-06T16:28:00.056Z] -Djava.net.preferIPv4Stack=true \
[2025-02-06T16:28:00.056Z] com.sun.javatest.regtest.agent.MainWrapper /home/jenkins/workspace/Test_openjdk11_hs_extended.openjdk_s390x_linux_testList_4/aqa-tests/TKG/output_17388506952171/jdk_net_1/work/java/net/MulticastSocket/SetLoopbackModeIPv4.d/main.0.jta
[2025-02-06T16:28:00.056Z]
[2025-02-06T16:28:00.056Z] TEST RESULT: Failed. Execution failed: `main' threw exception: java.lang.RuntimeException: Test failed
[2025-02-06T16:28:00.056Z] --------------------------------------------------
[2025-02-06T16:48:34.891Z] Test results: passed: 718; failed: 2
[2025-02-06T16:49:08.914Z] Report written to /home/jenkins/workspace/Test_openjdk11_hs_extended.openjdk_s390x_linux_testList_4/aqa-tests/TKG/output_17388506952171/jdk_net_1/report/html/report.html
[2025-02-06T16:49:08.914Z] Results written to /home/jenkins/workspace/Test_openjdk11_hs_extended.openjdk_s390x_linux_testList_4/aqa-tests/TKG/output_17388506952171/jdk_net_1/work
[2025-02-06T16:49:08.914Z] Error: Some tests failed or other problems occurred.
[2025-02-06T16:49:08.914Z] -----------------------------------
[2025-02-06T16:49:08.914Z] jdk_net_1_FAILED
[2025-02-06T16:49:08.914Z] -----------------------------------
[2025-02-06T16:49:08.914Z]
[2025-02-06T16:49:08.914Z] TEST TEARDOWN:
[2025-02-06T16:49:08.914Z] Nothing to be done for teardown.
[2025-02-06T16:49:08.914Z] jdk_net_1 Finish Time: Thu Feb 6 16:49:08 2025 Epoch Time (ms): 1738860548737