jdk11_tier1_pack200_1
[2025-07-16T00:31:18.512Z] Running test jdk11_tier1_pack200_1 ...
[2025-07-16T00:31:18.512Z] ===============================================
[2025-07-16T00:31:18.512Z] jdk11_tier1_pack200_1 Start Time: Wed Jul 16 00:31:18 2025 Epoch Time (ms): 1752625878181
[2025-07-16T00:31:18.512Z] variation: Mode650
[2025-07-16T00:31:18.512Z] JVM_OPTIONS: -XX:-UseCompressedOops
[2025-07-16T00:31:18.512Z] { \
[2025-07-16T00:31:18.512Z] echo ""; echo "TEST SETUP:"; \
[2025-07-16T00:31:18.512Z] echo "Nothing to be done for setup."; \
[2025-07-16T00:31:18.512Z] mkdir -p "/home/jenkins/workspace/Test_openjdk11_hs_sanity.openjdk_x86-64_alpine-linux_testList_2/aqa-tests/TKG/../TKG/output_17526115725647/jdk11_tier1_pack200_1"; \
[2025-07-16T00:31:18.512Z] cd "/home/jenkins/workspace/Test_openjdk11_hs_sanity.openjdk_x86-64_alpine-linux_testList_2/aqa-tests/TKG/../TKG/output_17526115725647/jdk11_tier1_pack200_1"; \
[2025-07-16T00:31:18.512Z] echo ""; echo "TESTING:"; \
[2025-07-16T00:31:18.512Z] "/home/jenkins/workspace/Test_openjdk11_hs_sanity.openjdk_x86-64_alpine-linux_testList_2/jdkbinary/j2sdk-image/bin/java" -Xmx512m -jar "/home/jenkins/workspace/Test_openjdk11_hs_sanity.openjdk_x86-64_alpine-linux_testList_2/aqa-tests/TKG/../../jvmtest/openjdk/jtreg/lib/jtreg.jar" \
[2025-07-16T00:31:18.512Z] -agentvm -a -ea -esa -v:fail,error,time,nopass -retain:fail,error,*.dmp,javacore.*,heapdump.*,*.trc -ignore:quiet -timeoutFactor:8 -xml:verify -k:'!headful' -concurrency:3 -nativepath:"/home/jenkins/workspace/Test_openjdk11_hs_sanity.openjdk_x86-64_alpine-linux_testList_2/jdkbinary/openjdk-test-image/jdk/jtreg/native" -vmoptions:"-Xmx512m -XX:-UseCompressedOops -Djava.awt.headless=true" \
[2025-07-16T00:31:18.512Z] \
[2025-07-16T00:31:18.512Z] -w ""/home/jenkins/workspace/Test_openjdk11_hs_sanity.openjdk_x86-64_alpine-linux_testList_2/aqa-tests/TKG/../TKG/output_17526115725647/jdk11_tier1_pack200_1"/work" \
[2025-07-16T00:31:18.512Z] -r ""/home/jenkins/workspace/Test_openjdk11_hs_sanity.openjdk_x86-64_alpine-linux_testList_2/aqa-tests/TKG/../TKG/output_17526115725647/jdk11_tier1_pack200_1"/report" \
[2025-07-16T00:31:18.512Z] -jdk:"/home/jenkins/workspace/Test_openjdk11_hs_sanity.openjdk_x86-64_alpine-linux_testList_2/jdkbinary/j2sdk-image" \
[2025-07-16T00:31:18.512Z] -exclude:"/home/jenkins/workspace/Test_openjdk11_hs_sanity.openjdk_x86-64_alpine-linux_testList_2/aqa-tests/TKG/../openjdk/openjdk-jdk/test/jdk/ProblemList.txt" \
[2025-07-16T00:31:18.512Z] -exclude:"/home/jenkins/workspace/Test_openjdk11_hs_sanity.openjdk_x86-64_alpine-linux_testList_2/aqa-tests/TKG/../../jvmtest/openjdk/excludes/ProblemList_openjdk11.txt" \
[2025-07-16T00:31:18.512Z] \
[2025-07-16T00:31:18.512Z] -exclude:"/home/jenkins/workspace/Test_openjdk11_hs_sanity.openjdk_x86-64_alpine-linux_testList_2/aqa-tests/TKG/../openjdk/excludes/vendors/eclipse/ProblemList_openjdk11.txt" \
[2025-07-16T00:31:18.512Z] "/home/jenkins/workspace/Test_openjdk11_hs_sanity.openjdk_x86-64_alpine-linux_testList_2/aqa-tests/TKG/../openjdk/openjdk-jdk/test/jdk/tools/pack200"; \
[2025-07-16T00:31:18.512Z] if [ $? -eq 0 ]; then echo "-----------------------------------"; echo "jdk11_tier1_pack200_1""_PASSED"; echo "-----------------------------------"; cd /home/jenkins/workspace/Test_openjdk11_hs_sanity.openjdk_x86-64_alpine-linux_testList_2/aqa-tests/TKG/..; else echo "-----------------------------------"; echo "jdk11_tier1_pack200_1""_FAILED"; echo "-----------------------------------"; fi; \
[2025-07-16T00:31:18.512Z] echo ""; echo "TEST TEARDOWN:"; \
[2025-07-16T00:31:18.512Z] echo "Nothing to be done for teardown."; \
[2025-07-16T00:31:18.512Z] } 2>&1 | tee -a "/home/jenkins/workspace/Test_openjdk11_hs_sanity.openjdk_x86-64_alpine-linux_testList_2/aqa-tests/TKG/../TKG/output_17526115725647/TestTargetResult";
[2025-07-16T00:31:18.512Z]
[2025-07-16T00:31:18.512Z] TEST SETUP:
[2025-07-16T00:31:18.512Z] Nothing to be done for setup.
[2025-07-16T00:31:18.512Z]
[2025-07-16T00:31:18.512Z] TESTING:
[2025-07-16T00:31:22.180Z] Directory "/home/jenkins/workspace/Test_openjdk11_hs_sanity.openjdk_x86-64_alpine-linux_testList_2/aqa-tests/TKG/../TKG/output_17526115725647/jdk11_tier1_pack200_1/work" not found: creating
[2025-07-16T00:31:22.180Z] Directory "/home/jenkins/workspace/Test_openjdk11_hs_sanity.openjdk_x86-64_alpine-linux_testList_2/aqa-tests/TKG/../TKG/output_17526115725647/jdk11_tier1_pack200_1/report" not found: creating
[2025-07-16T00:31:52.783Z] XML output with verification to /home/jenkins/workspace/Test_openjdk11_hs_sanity.openjdk_x86-64_alpine-linux_testList_2/aqa-tests/TKG/output_17526115725647/jdk11_tier1_pack200_1/work
[2025-07-16T00:52:11.587Z] --------------------------------------------------
[2025-07-16T00:52:11.587Z] TEST: tools/pack200/Pack200Props.java
[2025-07-16T00:52:11.587Z] TEST JDK: /home/jenkins/workspace/Test_openjdk11_hs_sanity.openjdk_x86-64_alpine-linux_testList_2/jdkbinary/j2sdk-image
[2025-07-16T00:52:11.587Z]
[2025-07-16T00:52:11.587Z] ACTION: compile -- Passed. Compilation successful
[2025-07-16T00:52:11.587Z] REASON: User specified action: run compile -XDignore.symbol.file Utils.java Pack200Props.java
[2025-07-16T00:52:11.587Z] TIME: 4.912 seconds
[2025-07-16T00:52:11.587Z] messages:
[2025-07-16T00:52:11.587Z] command: compile -XDignore.symbol.file /home/jenkins/workspace/Test_openjdk11_hs_sanity.openjdk_x86-64_alpine-linux_testList_2/aqa-tests/openjdk/openjdk-jdk/test/jdk/tools/pack200/Utils.java /home/jenkins/workspace/Test_openjdk11_hs_sanity.openjdk_x86-64_alpine-linux_testList_2/aqa-tests/openjdk/openjdk-jdk/test/jdk/tools/pack200/Pack200Props.java
[2025-07-16T00:52:11.587Z] reason: User specified action: run compile -XDignore.symbol.file Utils.java Pack200Props.java
[2025-07-16T00:52:11.587Z] started: Wed Jul 16 00:35:52 GMT 2025
[2025-07-16T00:52:11.587Z] Additional options from @modules: --add-modules java.logging,jdk.compiler,jdk.zipfs
[2025-07-16T00:52:11.587Z] Mode: agentvm
[2025-07-16T00:52:11.587Z] Agent id: 3
[2025-07-16T00:52:11.587Z] finished: Wed Jul 16 00:35:57 GMT 2025
[2025-07-16T00:52:11.587Z] elapsed time (seconds): 4.912
[2025-07-16T00:52:11.587Z] configuration:
[2025-07-16T00:52:11.587Z] Boot Layer (javac runtime environment)
[2025-07-16T00:52:11.587Z] class path: /home/jenkins/workspace/Test_openjdk11_hs_sanity.openjdk_x86-64_alpine-linux_testList_2/jvmtest/openjdk/jtreg/lib/javatest.jar
[2025-07-16T00:52:11.587Z] /home/jenkins/workspace/Test_openjdk11_hs_sanity.openjdk_x86-64_alpine-linux_testList_2/jvmtest/openjdk/jtreg/lib/jtreg.jar
[2025-07-16T00:52:11.588Z] patch: java.base /home/jenkins/workspace/Test_openjdk11_hs_sanity.openjdk_x86-64_alpine-linux_testList_2/aqa-tests/TKG/output_17526115725647/jdk11_tier1_pack200_1/work/patches/java.base
[2025-07-16T00:52:11.588Z]
[2025-07-16T00:52:11.588Z] javac compilation environment
[2025-07-16T00:52:11.588Z] add modules: java.logging jdk.compiler jdk.zipfs
[2025-07-16T00:52:11.588Z] source path: /home/jenkins/workspace/Test_openjdk11_hs_sanity.openjdk_x86-64_alpine-linux_testList_2/aqa-tests/openjdk/openjdk-jdk/test/jdk/tools/pack200
[2025-07-16T00:52:11.588Z] class path: /home/jenkins/workspace/Test_openjdk11_hs_sanity.openjdk_x86-64_alpine-linux_testList_2/aqa-tests/openjdk/openjdk-jdk/test/jdk/tools/pack200
[2025-07-16T00:52:11.588Z] /home/jenkins/workspace/Test_openjdk11_hs_sanity.openjdk_x86-64_alpine-linux_testList_2/aqa-tests/TKG/output_17526115725647/jdk11_tier1_pack200_1/work/classes/0/tools/pack200/Pack200Props.d
[2025-07-16T00:52:11.588Z]
[2025-07-16T00:52:11.588Z] rerun:
[2025-07-16T00:52:11.588Z] cd /home/jenkins/workspace/Test_openjdk11_hs_sanity.openjdk_x86-64_alpine-linux_testList_2/aqa-tests/TKG/output_17526115725647/jdk11_tier1_pack200_1/work/scratch/1 && \
[2025-07-16T00:52:11.588Z] DISPLAY=:0 \
[2025-07-16T00:52:11.588Z] HOME=/home/jenkins \
[2025-07-16T00:52:11.588Z] PATH=/bin:/usr/bin:/usr/sbin \
[2025-07-16T00:52:11.588Z] /home/jenkins/workspace/Test_openjdk11_hs_sanity.openjdk_x86-64_alpine-linux_testList_2/jdkbinary/j2sdk-image/bin/javac \
[2025-07-16T00:52:11.588Z] -J-ea \
[2025-07-16T00:52:11.588Z] -J-esa \
[2025-07-16T00:52:11.588Z] -J-Xmx512m \
[2025-07-16T00:52:11.588Z] -J-XX:-UseCompressedOops \
[2025-07-16T00:52:11.588Z] -J-Djava.awt.headless=true \
[2025-07-16T00:52:11.588Z] -J-Dtest.vm.opts='-ea -esa -Xmx512m -XX:-UseCompressedOops -Djava.awt.headless=true' \
[2025-07-16T00:52:11.588Z] -J-Dtest.tool.vm.opts='-J-ea -J-esa -J-Xmx512m -J-XX:-UseCompressedOops -J-Djava.awt.headless=true' \
[2025-07-16T00:52:11.588Z] -J-Dtest.compiler.opts= \
[2025-07-16T00:52:11.588Z] -J-Dtest.java.opts= \
[2025-07-16T00:52:11.588Z] -J-Dtest.jdk=/home/jenkins/workspace/Test_openjdk11_hs_sanity.openjdk_x86-64_alpine-linux_testList_2/jdkbinary/j2sdk-image \
[2025-07-16T00:52:11.588Z] -J-Dcompile.jdk=/home/jenkins/workspace/Test_openjdk11_hs_sanity.openjdk_x86-64_alpine-linux_testList_2/jdkbinary/j2sdk-image \
[2025-07-16T00:52:11.588Z] -J-Dtest.timeout.factor=8.0 \
[2025-07-16T00:52:11.588Z] -J-Dtest.nativepath=/home/jenkins/workspace/Test_openjdk11_hs_sanity.openjdk_x86-64_alpine-linux_testList_2/jdkbinary/openjdk-test-image/jdk/jtreg/native \
[2025-07-16T00:52:11.588Z] -J-Dtest.root=/home/jenkins/workspace/Test_openjdk11_hs_sanity.openjdk_x86-64_alpine-linux_testList_2/aqa-tests/openjdk/openjdk-jdk/test/jdk \
[2025-07-16T00:52:11.588Z] -J-Dtest.name=tools/pack200/Pack200Props.java \
[2025-07-16T00:52:11.588Z] -J-Dtest.file=/home/jenkins/workspace/Test_openjdk11_hs_sanity.openjdk_x86-64_alpine-linux_testList_2/aqa-tests/openjdk/openjdk-jdk/test/jdk/tools/pack200/Pack200Props.java \
[2025-07-16T00:52:11.588Z] -J-Dtest.src=/home/jenkins/workspace/Test_openjdk11_hs_sanity.openjdk_x86-64_alpine-linux_testList_2/aqa-tests/openjdk/openjdk-jdk/test/jdk/tools/pack200 \
[2025-07-16T00:52:11.588Z] -J-Dtest.src.path=/home/jenkins/workspace/Test_openjdk11_hs_sanity.openjdk_x86-64_alpine-linux_testList_2/aqa-tests/openjdk/openjdk-jdk/test/jdk/tools/pack200 \
[2025-07-16T00:52:11.588Z] -J-Dtest.classes=/home/jenkins/workspace/Test_openjdk11_hs_sanity.openjdk_x86-64_alpine-linux_testList_2/aqa-tests/TKG/output_17526115725647/jdk11_tier1_pack200_1/work/classes/0/tools/pack200/Pack200Props.d \
[2025-07-16T00:52:11.588Z] -J-Dtest.class.path=/home/jenkins/workspace/Test_openjdk11_hs_sanity.openjdk_x86-64_alpine-linux_testList_2/aqa-tests/TKG/output_17526115725647/jdk11_tier1_pack200_1/work/classes/0/tools/pack200/Pack200Props.d \
[2025-07-16T00:52:11.588Z] -J-Dtest.class.path.prefix=/home/jenkins/workspace/Test_openjdk11_hs_sanity.openjdk_x86-64_alpine-linux_testList_2/aqa-tests/TKG/output_17526115725647/jdk11_tier1_pack200_1/work/classes/0/tools/pack200/Pack200Props.d:/home/jenkins/workspace/Test_openjdk11_hs_sanity.openjdk_x86-64_alpine-linux_testList_2/aqa-tests/openjdk/openjdk-jdk/test/jdk/tools/pack200 \
[2025-07-16T00:52:11.588Z] -J-Dtest.modules='java.logging jdk.compiler jdk.zipfs' \
[2025-07-16T00:52:11.588Z] --add-modules java.logging,jdk.compiler,jdk.zipfs \
[2025-07-16T00:52:11.588Z] -d /home/jenkins/workspace/Test_openjdk11_hs_sanity.openjdk_x86-64_alpine-linux_testList_2/aqa-tests/TKG/output_17526115725647/jdk11_tier1_pack200_1/work/classes/0/tools/pack200/Pack200Props.d \
[2025-07-16T00:52:11.588Z] -sourcepath /home/jenkins/workspace/Test_openjdk11_hs_sanity.openjdk_x86-64_alpine-linux_testList_2/aqa-tests/openjdk/openjdk-jdk/test/jdk/tools/pack200 \
[2025-07-16T00:52:11.588Z] -classpath /home/jenkins/workspace/Test_openjdk11_hs_sanity.openjdk_x86-64_alpine-linux_testList_2/aqa-tests/openjdk/openjdk-jdk/test/jdk/tools/pack200:/home/jenkins/workspace/Test_openjdk11_hs_sanity.openjdk_x86-64_alpine-linux_testList_2/aqa-tests/TKG/output_17526115725647/jdk11_tier1_pack200_1/work/classes/0/tools/pack200/Pack200Props.d \
[2025-07-16T00:52:11.588Z] -XDignore.symbol.file /home/jenkins/workspace/Test_openjdk11_hs_sanity.openjdk_x86-64_alpine-linux_testList_2/aqa-tests/openjdk/openjdk-jdk/test/jdk/tools/pack200/Utils.java /home/jenkins/workspace/Test_openjdk11_hs_sanity.openjdk_x86-64_alpine-linux_testList_2/aqa-tests/openjdk/openjdk-jdk/test/jdk/tools/pack200/Pack200Props.java
[2025-07-16T00:52:11.588Z] direct:
[2025-07-16T00:52:11.588Z] /home/jenkins/workspace/Test_openjdk11_hs_sanity.openjdk_x86-64_alpine-linux_testList_2/aqa-tests/openjdk/openjdk-jdk/test/jdk/tools/pack200/Pack200Props.java:42: warning: [removal] Pack200 in java.util.jar has been deprecated and marked for removal
[2025-07-16T00:52:11.588Z] import java.util.jar.Pack200.Packer;
[2025-07-16T00:52:11.588Z] ^
[2025-07-16T00:52:11.588Z] /home/jenkins/workspace/Test_openjdk11_hs_sanity.openjdk_x86-64_alpine-linux_testList_2/aqa-tests/openjdk/openjdk-jdk/test/jdk/tools/pack200/Utils.java:419: warning: [removal] Pack200 in java.util.jar has been deprecated and marked for removal
[2025-07-16T00:52:11.588Z] Pack200.Packer packer = Pack200.newPacker();
[2025-07-16T00:52:11.588Z] ^
[2025-07-16T00:52:11.588Z] /home/jenkins/workspace/Test_openjdk11_hs_sanity.openjdk_x86-64_alpine-linux_testList_2/aqa-tests/openjdk/openjdk-jdk/test/jdk/tools/pack200/Utils.java:419: warning: [removal] Packer in Pack200 has been deprecated and marked for removal
[2025-07-16T00:52:11.588Z] Pack200.Packer packer = Pack200.newPacker();
[2025-07-16T00:52:11.588Z] ^
[2025-07-16T00:52:11.588Z] /home/jenkins/workspace/Test_openjdk11_hs_sanity.openjdk_x86-64_alpine-linux_testList_2/aqa-tests/openjdk/openjdk-jdk/test/jdk/tools/pack200/Utils.java:419: warning: [removal] Pack200 in java.util.jar has been deprecated and marked for removal
[2025-07-16T00:52:11.588Z] Pack200.Packer packer = Pack200.newPacker();
[2025-07-16T00:52:11.588Z] ^
[2025-07-16T00:52:11.588Z] /home/jenkins/workspace/Test_openjdk11_hs_sanity.openjdk_x86-64_alpine-linux_testList_2/aqa-tests/openjdk/openjdk-jdk/test/jdk/tools/pack200/Utils.java:457: warning: [removal] Pack200 in java.util.jar has been deprecated and marked for removal
[2025-07-16T00:52:11.588Z] Pack200.Unpacker unpacker = Pack200.newUnpacker();
[2025-07-16T00:52:11.588Z] ^
[2025-07-16T00:52:11.588Z] /home/jenkins/workspace/Test_openjdk11_hs_sanity.openjdk_x86-64_alpine-linux_testList_2/aqa-tests/openjdk/openjdk-jdk/test/jdk/tools/pack200/Utils.java:457: warning: [removal] Unpacker in Pack200 has been deprecated and marked for removal
[2025-07-16T00:52:11.588Z] Pack200.Unpacker unpacker = Pack200.newUnpacker();
[2025-07-16T00:52:11.588Z] ^
[2025-07-16T00:52:11.588Z] /home/jenkins/workspace/Test_openjdk11_hs_sanity.openjdk_x86-64_alpine-linux_testList_2/aqa-tests/openjdk/openjdk-jdk/test/jdk/tools/pack200/Utils.java:457: warning: [removal] Pack200 in java.util.jar has been deprecated and marked for removal
[2025-07-16T00:52:11.588Z] Pack200.Unpacker unpacker = Pack200.newUnpacker();
[2025-07-16T00:52:11.588Z] ^
[2025-07-16T00:52:11.588Z] /home/jenkins/workspace/Test_openjdk11_hs_sanity.openjdk_x86-64_alpine-linux_testList_2/aqa-tests/openjdk/openjdk-jdk/test/jdk/tools/pack200/Pack200Props.java:98: warning: [removal] Packer in Pack200 has been deprecated and marked for removal
[2025-07-16T00:52:11.588Z] Packer p = Pack200.newPacker();
[2025-07-16T00:52:11.588Z] ^
[2025-07-16T00:52:11.588Z] /home/jenkins/workspace/Test_openjdk11_hs_sanity.openjdk_x86-64_alpine-linux_testList_2/aqa-tests/openjdk/openjdk-jdk/test/jdk/tools/pack200/Pack200Props.java:98: warning: [removal] Pack200 in java.util.jar has been deprecated and marked for removal
[2025-07-16T00:52:11.588Z] Packer p = Pack200.newPacker();
[2025-07-16T00:52:11.588Z] ^
[2025-07-16T00:52:11.588Z] 9 warnings
[2025-07-16T00:52:11.588Z]
[2025-07-16T00:52:11.588Z] ACTION: build -- Passed. All files up to date
[2025-07-16T00:52:11.588Z] REASON: Named class compiled on demand
[2025-07-16T00:52:11.588Z] TIME: 0.0 seconds
[2025-07-16T00:52:11.588Z] messages:
[2025-07-16T00:52:11.588Z] command: build Pack200Props
[2025-07-16T00:52:11.588Z] reason: Named class compiled on demand
[2025-07-16T00:52:11.588Z] started: Wed Jul 16 00:35:57 GMT 2025
[2025-07-16T00:52:11.588Z] finished: Wed Jul 16 00:35:57 GMT 2025
[2025-07-16T00:52:11.588Z] elapsed time (seconds): 0.0
[2025-07-16T00:52:11.588Z]
[2025-07-16T00:52:11.588Z] ACTION: main -- Error. Agent error: java.lang.Exception: Agent 7 timed out with a timeout of 960 seconds; check console log for any additional details
[2025-07-16T00:52:11.588Z] REASON: User specified action: run main Pack200Props
[2025-07-16T00:52:11.588Z] TIME: 964.031 seconds
[2025-07-16T00:52:11.588Z] messages:
[2025-07-16T00:52:11.588Z] command: main Pack200Props
[2025-07-16T00:52:11.588Z] reason: User specified action: run main Pack200Props
[2025-07-16T00:52:11.588Z] started: Wed Jul 16 00:35:57 GMT 2025
[2025-07-16T00:52:11.588Z] Mode: agentvm
[2025-07-16T00:52:11.588Z] Agent id: 7
[2025-07-16T00:52:11.588Z] Timeout signalled after 960 seconds
[2025-07-16T00:52:11.588Z] Timeout information:
[2025-07-16T00:52:11.588Z] Running jstack on process 1972020
[2025-07-16T00:52:11.588Z] 2025-07-16 00:52:01
[2025-07-16T00:52:11.589Z] Full thread dump OpenJDK 64-Bit Server VM (11.0.28+4 mixed mode):
[2025-07-16T00:52:11.589Z]
[2025-07-16T00:52:11.589Z] Threads class SMR info:
[2025-07-16T00:52:11.589Z] _java_thread_list=0x00007cf74e833540, length=13, elements={
[2025-07-16T00:52:11.589Z] 0x00007cf7834f8800, 0x00007cf752645800, 0x00007cf75263e800, 0x00007cf75263f800,
[2025-07-16T00:52:11.589Z] 0x00007cf752615800, 0x00007cf752616800, 0x00007cf752611800, 0x00007cf752612800,
[2025-07-16T00:52:11.589Z] 0x00007cf752603800, 0x00007cf752604800, 0x00007cf752606800, 0x00007cf74e902800,
[2025-07-16T00:52:11.589Z] 0x00007cf752605800
[2025-07-16T00:52:11.589Z] }
[2025-07-16T00:52:11.589Z]
[2025-07-16T00:52:11.589Z] "main" #1 prio=5 os_prio=0 cpu=574.16ms elapsed=1076.21s tid=0x00007cf7834f8800 nid=0x1e1738 in Object.wait() [0x00007cf78bede000]
[2025-07-16T00:52:11.589Z] java.lang.Thread.State: WAITING (on object monitor)
[2025-07-16T00:52:11.589Z] at java.lang.Object.wait(java.base@11.0.28/Native Method)
[2025-07-16T00:52:11.589Z] - waiting on <0x00007cf753ed2e90> (a java.lang.Thread)
[2025-07-16T00:52:11.589Z] at java.lang.Thread.join(java.base@11.0.28/Thread.java:1300)
[2025-07-16T00:52:11.589Z] - waiting to re-lock in wait() <0x00007cf753ed2e90> (a java.lang.Thread)
[2025-07-16T00:52:11.589Z] at java.lang.Thread.join(java.base@11.0.28/Thread.java:1375)
[2025-07-16T00:52:11.589Z] at com.sun.javatest.regtest.agent.MainActionHelper.runClass(MainActionHelper.java:219)
[2025-07-16T00:52:11.589Z] at com.sun.javatest.regtest.agent.AgentServer.doMain(AgentServer.java:317)
[2025-07-16T00:52:11.589Z] at com.sun.javatest.regtest.agent.AgentServer.run(AgentServer.java:242)
[2025-07-16T00:52:11.589Z] at com.sun.javatest.regtest.agent.AgentServer.main(AgentServer.java:71)
[2025-07-16T00:52:11.589Z]
[2025-07-16T00:52:11.589Z] "Reference Handler" #2 daemon prio=10 os_prio=0 cpu=1.66ms elapsed=1075.88s tid=0x00007cf752645800 nid=0x1e1742 waiting on condition [0x00007cf74f6fc000]
[2025-07-16T00:52:11.589Z] java.lang.Thread.State: RUNNABLE
[2025-07-16T00:52:11.589Z] at java.lang.ref.Reference.waitForReferencePendingList(java.base@11.0.28/Native Method)
[2025-07-16T00:52:11.589Z] at java.lang.ref.Reference.processPendingReferences(java.base@11.0.28/Reference.java:241)
[2025-07-16T00:52:11.589Z] at java.lang.ref.Reference$ReferenceHandler.run(java.base@11.0.28/Reference.java:213)
[2025-07-16T00:52:11.589Z]
[2025-07-16T00:52:11.589Z] "Finalizer" #3 daemon prio=8 os_prio=0 cpu=0.62ms elapsed=1075.87s tid=0x00007cf75263e800 nid=0x1e1743 in Object.wait() [0x00007cf74f5fb000]
[2025-07-16T00:52:11.589Z] java.lang.Thread.State: WAITING (on object monitor)
[2025-07-16T00:52:11.589Z] at java.lang.Object.wait(java.base@11.0.28/Native Method)
[2025-07-16T00:52:11.589Z] - waiting on <0x00007cf754073768> (a java.lang.ref.ReferenceQueue$Lock)
[2025-07-16T00:52:11.589Z] at java.lang.ref.ReferenceQueue.remove(java.base@11.0.28/ReferenceQueue.java:155)
[2025-07-16T00:52:11.589Z] - waiting to re-lock in wait() <0x00007cf754073768> (a java.lang.ref.ReferenceQueue$Lock)
[2025-07-16T00:52:11.589Z] at java.lang.ref.ReferenceQueue.remove(java.base@11.0.28/ReferenceQueue.java:176)
[2025-07-16T00:52:11.589Z] at java.lang.ref.Finalizer$FinalizerThread.run(java.base@11.0.28/Finalizer.java:170)
[2025-07-16T00:52:11.589Z]
[2025-07-16T00:52:11.589Z] "Signal Dispatcher" #4 daemon prio=9 os_prio=0 cpu=0.43ms elapsed=1075.73s tid=0x00007cf75263f800 nid=0x1e1745 runnable [0x0000000000000000]
[2025-07-16T00:52:11.589Z] java.lang.Thread.State: RUNNABLE
[2025-07-16T00:52:11.589Z]
[2025-07-16T00:52:11.589Z] "Service Thread" #5 daemon prio=9 os_prio=0 cpu=0.08ms elapsed=1075.72s tid=0x00007cf752615800 nid=0x1e1748 runnable [0x0000000000000000]
[2025-07-16T00:52:11.589Z] java.lang.Thread.State: RUNNABLE
[2025-07-16T00:52:11.589Z]
[2025-07-16T00:52:11.589Z] "C2 CompilerThread0" #6 daemon prio=9 os_prio=0 cpu=3439.14ms elapsed=1075.72s tid=0x00007cf752616800 nid=0x1e174a waiting on condition [0x0000000000000000]
[2025-07-16T00:52:11.589Z] java.lang.Thread.State: RUNNABLE
[2025-07-16T00:52:11.589Z] No compile task
[2025-07-16T00:52:11.589Z]
[2025-07-16T00:52:11.589Z] "C1 CompilerThread0" #8 daemon prio=9 os_prio=0 cpu=760.18ms elapsed=1075.69s tid=0x00007cf752611800 nid=0x1e174c waiting on condition [0x0000000000000000]
[2025-07-16T00:52:11.589Z] java.lang.Thread.State: RUNNABLE
[2025-07-16T00:52:11.589Z] No compile task
[2025-07-16T00:52:11.589Z]
[2025-07-16T00:52:11.589Z] "Sweeper thread" #9 daemon prio=9 os_prio=0 cpu=0.08ms elapsed=1075.66s tid=0x00007cf752612800 nid=0x1e174d runnable [0x0000000000000000]
[2025-07-16T00:52:11.589Z] java.lang.Thread.State: RUNNABLE
[2025-07-16T00:52:11.589Z]
[2025-07-16T00:52:11.589Z] "Common-Cleaner" #10 daemon prio=8 os_prio=0 cpu=1.62ms elapsed=1075.19s tid=0x00007cf752603800 nid=0x1e174f in Object.wait() [0x00007cf74ef9d000]
[2025-07-16T00:52:11.589Z] java.lang.Thread.State: TIMED_WAITING (on object monitor)
[2025-07-16T00:52:11.589Z] at java.lang.Object.wait(java.base@11.0.28/Native Method)
[2025-07-16T00:52:11.589Z] - waiting on <0x00007cf753ee0d90> (a java.lang.ref.ReferenceQueue$Lock)
[2025-07-16T00:52:11.589Z] at java.lang.ref.ReferenceQueue.remove(java.base@11.0.28/ReferenceQueue.java:155)
[2025-07-16T00:52:11.589Z] - waiting to re-lock in wait() <0x00007cf753ee0d90> (a java.lang.ref.ReferenceQueue$Lock)
[2025-07-16T00:52:11.589Z] at jdk.internal.ref.CleanerImpl.run(java.base@11.0.28/CleanerImpl.java:148)
[2025-07-16T00:52:11.589Z] at java.lang.Thread.run(java.base@11.0.28/Thread.java:829)
[2025-07-16T00:52:11.589Z] at jdk.internal.misc.InnocuousThread.run(java.base@11.0.28/InnocuousThread.java:161)
[2025-07-16T00:52:11.589Z]
[2025-07-16T00:52:11.589Z] "pool-1-thread-1" #11 daemon prio=5 os_prio=0 cpu=10.81ms elapsed=1071.40s tid=0x00007cf752604800 nid=0x1e1766 waiting on condition [0x00007cf74e5fe000]
[2025-07-16T00:52:11.589Z] java.lang.Thread.State: TIMED_WAITING (parking)
[2025-07-16T00:52:11.589Z] at jdk.internal.misc.Unsafe.park(java.base@11.0.28/Native Method)
[2025-07-16T00:52:11.589Z] - parking to wait for <0x00007cf753fb49f0> (a java.util.concurrent.locks.AbstractQueuedSynchronizer$ConditionObject)
[2025-07-16T00:52:11.589Z] at java.util.concurrent.locks.LockSupport.parkNanos(java.base@11.0.28/LockSupport.java:234)
[2025-07-16T00:52:11.589Z] at java.util.concurrent.locks.AbstractQueuedSynchronizer$ConditionObject.awaitNanos(java.base@11.0.28/AbstractQueuedSynchronizer.java:2123)
[2025-07-16T00:52:11.589Z] at java.util.concurrent.ScheduledThreadPoolExecutor$DelayedWorkQueue.take(java.base@11.0.28/ScheduledThreadPoolExecutor.java:1182)
[2025-07-16T00:52:11.589Z] at java.util.concurrent.ScheduledThreadPoolExecutor$DelayedWorkQueue.take(java.base@11.0.28/ScheduledThreadPoolExecutor.java:899)
[2025-07-16T00:52:11.589Z] at java.util.concurrent.ThreadPoolExecutor.getTask(java.base@11.0.28/ThreadPoolExecutor.java:1054)
[2025-07-16T00:52:11.589Z] at java.util.concurrent.ThreadPoolExecutor.runWorker(java.base@11.0.28/ThreadPoolExecutor.java:1114)
[2025-07-16T00:52:11.589Z] at java.util.concurrent.ThreadPoolExecutor$Worker.run(java.base@11.0.28/ThreadPoolExecutor.java:628)
[2025-07-16T00:52:11.589Z] at java.lang.Thread.run(java.base@11.0.28/Thread.java:829)
[2025-07-16T00:52:11.589Z]
[2025-07-16T00:52:11.589Z] "AgentVMThread" #14 prio=5 os_prio=0 cpu=8948.32ms elapsed=963.59s tid=0x00007cf752606800 nid=0x1e196d runnable [0x00007cf74e4fd000]
[2025-07-16T00:52:11.589Z] java.lang.Thread.State: RUNNABLE
[2025-07-16T00:52:11.589Z] at java.io.FileInputStream.readBytes(java.base@11.0.28/Native Method)
[2025-07-16T00:52:11.589Z] at java.io.FileInputStream.read(java.base@11.0.28/FileInputStream.java:279)
[2025-07-16T00:52:11.589Z] at java.io.BufferedInputStream.read1(java.base@11.0.28/BufferedInputStream.java:290)
[2025-07-16T00:52:11.589Z] at java.io.BufferedInputStream.read(java.base@11.0.28/BufferedInputStream.java:351)
[2025-07-16T00:52:11.589Z] - locked <0x00007cf75cd3bb98> (a java.lang.ProcessImpl$ProcessPipeInputStream)
[2025-07-16T00:52:11.589Z] at sun.nio.cs.StreamDecoder.readBytes(java.base@11.0.28/StreamDecoder.java:295)
[2025-07-16T00:52:11.589Z] at sun.nio.cs.StreamDecoder.implRead(java.base@11.0.28/StreamDecoder.java:337)
[2025-07-16T00:52:11.589Z] at sun.nio.cs.StreamDecoder.read(java.base@11.0.28/StreamDecoder.java:179)
[2025-07-16T00:52:11.589Z] - locked <0x00007cf75cd403d8> (a java.io.InputStreamReader)
[2025-07-16T00:52:11.589Z] at java.io.InputStreamReader.read(java.base@11.0.28/InputStreamReader.java:181)
[2025-07-16T00:52:11.589Z] at java.io.BufferedReader.fill(java.base@11.0.28/BufferedReader.java:161)
[2025-07-16T00:52:11.589Z] at java.io.BufferedReader.readLine(java.base@11.0.28/BufferedReader.java:326)
[2025-07-16T00:52:11.589Z] - locked <0x00007cf75cd403d8> (a java.io.InputStreamReader)
[2025-07-16T00:52:11.589Z] at java.io.BufferedReader.readLine(java.base@11.0.28/BufferedReader.java:392)
[2025-07-16T00:52:11.589Z] at Utils.runExec(Utils.java:533)
[2025-07-16T00:52:11.589Z] at Utils.runExec(Utils.java:500)
[2025-07-16T00:52:11.589Z] at Utils.runExec(Utils.java:496)
[2025-07-16T00:52:11.589Z] at Pack200Props.verifySegmentLimit(Pack200Props.java:77)
[2025-07-16T00:52:11.589Z] at Pack200Props.main(Pack200Props.java:58)
[2025-07-16T00:52:11.589Z] at jdk.internal.reflect.NativeMethodAccessorImpl.invoke0(java.base@11.0.28/Native Method)
[2025-07-16T00:52:11.589Z] at jdk.internal.reflect.NativeMethodAccessorImpl.invoke(java.base@11.0.28/NativeMethodAccessorImpl.java:62)
[2025-07-16T00:52:11.589Z] at jdk.internal.reflect.DelegatingMethodAccessorImpl.invoke(java.base@11.0.28/DelegatingMethodAccessorImpl.java:43)
[2025-07-16T00:52:11.589Z] at java.lang.reflect.Method.invoke(java.base@11.0.28/Method.java:566)
[2025-07-16T00:52:11.589Z] at com.sun.javatest.regtest.agent.MainActionHelper$AgentVMRunnable.run(MainActionHelper.java:333)
[2025-07-16T00:52:11.589Z] at java.lang.Thread.run(java.base@11.0.28/Thread.java:829)
[2025-07-16T00:52:11.589Z]
[2025-07-16T00:52:11.589Z] "process reaper (pid 1972874)" #16 daemon prio=10 os_prio=0 cpu=0.42ms elapsed=859.86s tid=0x00007cf74e902800 nid=0x1e1a8b runnable [0x00007cf74e901000]
[2025-07-16T00:52:11.589Z] java.lang.Thread.State: RUNNABLE
[2025-07-16T00:52:11.589Z] at java.lang.ProcessHandleImpl.waitForProcessExit0(java.base@11.0.28/Native Method)
[2025-07-16T00:52:11.589Z] at java.lang.ProcessHandleImpl$1.run(java.base@11.0.28/ProcessHandleImpl.java:145)
[2025-07-16T00:52:11.589Z] at java.util.concurrent.ThreadPoolExecutor.runWorker(java.base@11.0.28/ThreadPoolExecutor.java:1128)
[2025-07-16T00:52:11.590Z] at java.util.concurrent.ThreadPoolExecutor$Worker.run(java.base@11.0.28/ThreadPoolExecutor.java:628)
[2025-07-16T00:52:11.590Z] at java.lang.Thread.run(java.base@11.0.28/Thread.java:829)
[2025-07-16T00:52:11.590Z]
[2025-07-16T00:52:11.590Z] "Attach Listener" #17 daemon prio=9 os_prio=0 cpu=0.48ms elapsed=0.12s tid=0x00007cf752605800 nid=0x1e1ef8 runnable [0x0000000000000000]
[2025-07-16T00:52:11.590Z] java.lang.Thread.State: RUNNABLE
[2025-07-16T00:52:11.590Z]
[2025-07-16T00:52:11.590Z] "VM Thread" os_prio=0 cpu=144.30ms elapsed=1075.94s tid=0x00007cf752644800 nid=0x1e173f runnable
[2025-07-16T00:52:11.590Z]
[2025-07-16T00:52:11.590Z] "GC Thread#0" os_prio=0 cpu=155.91ms elapsed=1076.17s tid=0x00007cf7834b0800 nid=0x1e1739 runnable
[2025-07-16T00:52:11.590Z]
[2025-07-16T00:52:11.590Z] "GC Thread#1" os_prio=0 cpu=139.59ms elapsed=960.78s tid=0x00007cf74ec4e800 nid=0x1e1985 runnable
[2025-07-16T00:52:11.590Z]
[2025-07-16T00:52:11.590Z] "GC Thread#2" os_prio=0 cpu=148.50ms elapsed=960.78s tid=0x00007cf74ec4f800 nid=0x1e1986 runnable
[2025-07-16T00:52:11.590Z]
[2025-07-16T00:52:11.590Z] "GC Thread#3" os_prio=0 cpu=132.51ms elapsed=960.75s tid=0x00007cf74eccb800 nid=0x1e1987 runnable
[2025-07-16T00:52:11.590Z]
[2025-07-16T00:52:11.590Z] "G1 Main Marker" os_prio=0 cpu=5.04ms elapsed=1076.16s tid=0x00007cf783483800 nid=0x1e173a runnable
[2025-07-16T00:52:11.590Z]
[2025-07-16T00:52:11.590Z] "G1 Conc#0" os_prio=0 cpu=630.25ms elapsed=1076.16s tid=0x00007cf783480800 nid=0x1e173b runnable
[2025-07-16T00:52:11.590Z]
[2025-07-16T00:52:11.590Z] "G1 Refine#0" os_prio=0 cpu=8.09ms elapsed=1076.14s tid=0x00007cf783411800 nid=0x1e173c runnable
[2025-07-16T00:52:11.590Z]
[2025-07-16T00:52:11.590Z] "G1 Refine#1" os_prio=0 cpu=0.10ms elapsed=960.51s tid=0x00007cf74eccc000 nid=0x1e1989 runnable
[2025-07-16T00:52:11.590Z]
[2025-07-16T00:52:11.590Z] "G1 Young RemSet Sampling" os_prio=0 cpu=207.32ms elapsed=1076.13s tid=0x00007cf78340c800 nid=0x1e173d runnable
[2025-07-16T00:52:11.590Z] "VM Periodic Task Thread" os_prio=0 cpu=557.35ms elapsed=1073.97s tid=0x00007cf74ec4c800 nid=0x1e1753 waiting on condition
[2025-07-16T00:52:11.590Z]
[2025-07-16T00:52:11.590Z] JNI global refs: 15, weak refs: 0
[2025-07-16T00:52:11.590Z]
[2025-07-16T00:52:11.590Z] --- Timeout information end.
[2025-07-16T00:52:11.590Z] finished: Wed Jul 16 00:52:01 GMT 2025
[2025-07-16T00:52:11.590Z] elapsed time (seconds): 964.031
[2025-07-16T00:52:11.590Z] configuration:
[2025-07-16T00:52:11.590Z] Boot Layer
[2025-07-16T00:52:11.590Z] class path: /home/jenkins/workspace/Test_openjdk11_hs_sanity.openjdk_x86-64_alpine-linux_testList_2/jvmtest/openjdk/jtreg/lib/javatest.jar
[2025-07-16T00:52:11.590Z] /home/jenkins/workspace/Test_openjdk11_hs_sanity.openjdk_x86-64_alpine-linux_testList_2/jvmtest/openjdk/jtreg/lib/jtreg.jar
[2025-07-16T00:52:11.590Z] /home/jenkins/workspace/Test_openjdk11_hs_sanity.openjdk_x86-64_alpine-linux_testList_2/jvmtest/openjdk/jtreg/lib/junit-platform-console-standalone-1.9.2.jar
[2025-07-16T00:52:11.590Z] /home/jenkins/workspace/Test_openjdk11_hs_sanity.openjdk_x86-64_alpine-linux_testList_2/jvmtest/openjdk/jtreg/lib/testng-7.3.0.jar
[2025-07-16T00:52:11.590Z] /home/jenkins/workspace/Test_openjdk11_hs_sanity.openjdk_x86-64_alpine-linux_testList_2/jvmtest/openjdk/jtreg/lib/guice-5.1.0.jar
[2025-07-16T00:52:11.590Z] /home/jenkins/workspace/Test_openjdk11_hs_sanity.openjdk_x86-64_alpine-linux_testList_2/jvmtest/openjdk/jtreg/lib/jcommander-1.82.jar
[2025-07-16T00:52:11.590Z] patch: java.base /home/jenkins/workspace/Test_openjdk11_hs_sanity.openjdk_x86-64_alpine-linux_testList_2/aqa-tests/TKG/output_17526115725647/jdk11_tier1_pack200_1/work/patches/java.base
[2025-07-16T00:52:11.590Z]
[2025-07-16T00:52:11.590Z] Test Layer
[2025-07-16T00:52:11.590Z] class path: /home/jenkins/workspace/Test_openjdk11_hs_sanity.openjdk_x86-64_alpine-linux_testList_2/aqa-tests/TKG/output_17526115725647/jdk11_tier1_pack200_1/work/classes/0/tools/pack200/Pack200Props.d
[2025-07-16T00:52:11.590Z] /home/jenkins/workspace/Test_openjdk11_hs_sanity.openjdk_x86-64_alpine-linux_testList_2/aqa-tests/openjdk/openjdk-jdk/test/jdk/tools/pack200
[2025-07-16T00:52:11.590Z]
[2025-07-16T00:52:11.590Z] rerun:
[2025-07-16T00:52:11.590Z] cd /home/jenkins/workspace/Test_openjdk11_hs_sanity.openjdk_x86-64_alpine-linux_testList_2/aqa-tests/TKG/output_17526115725647/jdk11_tier1_pack200_1/work/scratch/1 && \
[2025-07-16T00:52:11.590Z] DISPLAY=:0 \
[2025-07-16T00:52:11.590Z] HOME=/home/jenkins \
[2025-07-16T00:52:11.590Z] PATH=/bin:/usr/bin:/usr/sbin \
[2025-07-16T00:52:11.590Z] /home/jenkins/workspace/Test_openjdk11_hs_sanity.openjdk_x86-64_alpine-linux_testList_2/jdkbinary/j2sdk-image/bin/java \
[2025-07-16T00:52:11.590Z] -Dtest.vm.opts='-ea -esa -Xmx512m -XX:-UseCompressedOops -Djava.awt.headless=true' \
[2025-07-16T00:52:11.590Z] -Dtest.tool.vm.opts='-J-ea -J-esa -J-Xmx512m -J-XX:-UseCompressedOops -J-Djava.awt.headless=true' \
[2025-07-16T00:52:11.590Z] -Dtest.compiler.opts= \
[2025-07-16T00:52:11.590Z] -Dtest.java.opts= \
[2025-07-16T00:52:11.590Z] -Dtest.jdk=/home/jenkins/workspace/Test_openjdk11_hs_sanity.openjdk_x86-64_alpine-linux_testList_2/jdkbinary/j2sdk-image \
[2025-07-16T00:52:11.590Z] -Dcompile.jdk=/home/jenkins/workspace/Test_openjdk11_hs_sanity.openjdk_x86-64_alpine-linux_testList_2/jdkbinary/j2sdk-image \
[2025-07-16T00:52:11.590Z] -Dtest.timeout.factor=8.0 \
[2025-07-16T00:52:11.590Z] -Dtest.nativepath=/home/jenkins/workspace/Test_openjdk11_hs_sanity.openjdk_x86-64_alpine-linux_testList_2/jdkbinary/openjdk-test-image/jdk/jtreg/native \
[2025-07-16T00:52:11.590Z] -Dtest.root=/home/jenkins/workspace/Test_openjdk11_hs_sanity.openjdk_x86-64_alpine-linux_testList_2/aqa-tests/openjdk/openjdk-jdk/test/jdk \
[2025-07-16T00:52:11.590Z] -Dtest.name=tools/pack200/Pack200Props.java \
[2025-07-16T00:52:11.590Z] -Dtest.file=/home/jenkins/workspace/Test_openjdk11_hs_sanity.openjdk_x86-64_alpine-linux_testList_2/aqa-tests/openjdk/openjdk-jdk/test/jdk/tools/pack200/Pack200Props.java \
[2025-07-16T00:52:11.590Z] -Dtest.src=/home/jenkins/workspace/Test_openjdk11_hs_sanity.openjdk_x86-64_alpine-linux_testList_2/aqa-tests/openjdk/openjdk-jdk/test/jdk/tools/pack200 \
[2025-07-16T00:52:11.590Z] -Dtest.src.path=/home/jenkins/workspace/Test_openjdk11_hs_sanity.openjdk_x86-64_alpine-linux_testList_2/aqa-tests/openjdk/openjdk-jdk/test/jdk/tools/pack200 \
[2025-07-16T00:52:11.590Z] -Dtest.classes=/home/jenkins/workspace/Test_openjdk11_hs_sanity.openjdk_x86-64_alpine-linux_testList_2/aqa-tests/TKG/output_17526115725647/jdk11_tier1_pack200_1/work/classes/0/tools/pack200/Pack200Props.d \
[2025-07-16T00:52:11.590Z] -Dtest.class.path=/home/jenkins/workspace/Test_openjdk11_hs_sanity.openjdk_x86-64_alpine-linux_testList_2/aqa-tests/TKG/output_17526115725647/jdk11_tier1_pack200_1/work/classes/0/tools/pack200/Pack200Props.d \
[2025-07-16T00:52:11.590Z] -Dtest.class.path.prefix=/home/jenkins/workspace/Test_openjdk11_hs_sanity.openjdk_x86-64_alpine-linux_testList_2/aqa-tests/TKG/output_17526115725647/jdk11_tier1_pack200_1/work/classes/0/tools/pack200/Pack200Props.d:/home/jenkins/workspace/Test_openjdk11_hs_sanity.openjdk_x86-64_alpine-linux_testList_2/aqa-tests/openjdk/openjdk-jdk/test/jdk/tools/pack200 \
[2025-07-16T00:52:11.590Z] -Dtest.modules='java.logging jdk.compiler jdk.zipfs' \
[2025-07-16T00:52:11.590Z] -classpath /home/jenkins/workspace/Test_openjdk11_hs_sanity.openjdk_x86-64_alpine-linux_testList_2/aqa-tests/TKG/output_17526115725647/jdk11_tier1_pack200_1/work/classes/0/tools/pack200/Pack200Props.d:/home/jenkins/workspace/Test_openjdk11_hs_sanity.openjdk_x86-64_alpine-linux_testList_2/aqa-tests/openjdk/openjdk-jdk/test/jdk/tools/pack200:/home/jenkins/workspace/Test_openjdk11_hs_sanity.openjdk_x86-64_alpine-linux_testList_2/jvmtest/openjdk/jtreg/lib/javatest.jar:/home/jenkins/workspace/Test_openjdk11_hs_sanity.openjdk_x86-64_alpine-linux_testList_2/jvmtest/openjdk/jtreg/lib/jtreg.jar \
[2025-07-16T00:52:11.590Z] Pack200Props
[2025-07-16T00:52:11.590Z] STDERR:
[2025-07-16T00:52:11.590Z] Jul 16, 2025 12:35:58 AM Pack200Props verifyDefaults
[2025-07-16T00:52:11.590Z] INFO: start
[2025-07-16T00:52:11.590Z] Jul 16, 2025 12:35:59 AM Pack200Props verifyDefaults
[2025-07-16T00:52:11.590Z] INFO: fini
[2025-07-16T00:52:11.590Z] Jul 16, 2025 12:35:59 AM Pack200Props verifySegmentLimit
[2025-07-16T00:52:11.590Z] INFO: creating jar
[2025-07-16T00:52:11.590Z] Jul 16, 2025 12:37:41 AM Pack200Props verifySegmentLimit
[2025-07-16T00:52:11.590Z] INFO: using pack200: /home/jenkins/workspace/Test_openjdk11_hs_sanity.openjdk_x86-64_alpine-linux_testList_2/jdkbinary/j2sdk-image/bin/pack200
[2025-07-16T00:52:11.590Z] STDOUT:
[2025-07-16T00:52:11.590Z] --listing /home/jenkins/workspace/Test_openjdk11_hs_sanity.openjdk_x86-64_alpine-linux_testList_2/aqa-tests/TKG/output_17526115725647/jdk11_tier1_pack200_1/work/scratch/1/.---
[2025-07-16T00:52:11.590Z] - rt.jar
[2025-07-16T00:52:11.590Z] /home/jenkins/workspace/Test_openjdk11_hs_sanity.openjdk_x86-64_alpine-linux_testList_2/jdkbinary/j2sdk-image/bin/pack200 -J-Xshare:off -J-Xmx1280m --effort=1 --verbose --no-gzip test.pack /home/jenkins/workspace/Test_openjdk11_hs_sanity.openjdk_x86-64_alpine-linux_testList_2/aqa-tests/TKG/output_17526115725647/jdk11_tier1_pack200_1/work/scratch/1/rt.jar
[2025-07-16T00:52:11.590Z]
[2025-07-16T00:52:11.590Z] Warning: The pack200 tool is deprecated, and is planned for removal in a future JDK release.
[2025-07-16T00:52:11.590Z]
[2025-07-16T00:52:11.590Z] Jul 16, 2025 12:37:47 AM com.sun.java.util.jar.pack.Utils$Pack200Logger info
[2025-07-16T00:52:11.590Z] INFO: com.sun.java.util.jar.pack.PropMap@f5f2bb7
[2025-07-16T00:52:11.590Z] Jul 16, 2025 12:37:48 AM com.sun.java.util.jar.pack.Utils$Pack200Logger info
[2025-07-16T00:52:11.590Z] INFO: passFiles = []
[2025-07-16T00:52:11.590Z] Jul 16, 2025 12:37:51 AM com.sun.java.util.jar.pack.Utils$Pack200Logger info
[2025-07-16T00:52:11.590Z] INFO: Reading 32095 files...
[2025-07-16T00:52:11.590Z] Jul 16, 2025 12:38:04 AM com.sun.java.util.jar.pack.Utils$Pack200Logger info
[2025-07-16T00:52:11.590Z] INFO: Have read 1000 files...
[2025-07-16T00:52:11.590Z] Jul 16, 2025 12:38:11 AM com.sun.java.util.jar.pack.Utils$Pack200Logger info
[2025-07-16T00:52:11.590Z] INFO: Have read 2000 files...
[2025-07-16T00:52:11.590Z] Jul 16, 2025 12:38:20 AM com.sun.java.util.jar.pack.Utils$Pack200Logger info
[2025-07-16T00:52:11.590Z] INFO: Have read 3000 files...
[2025-07-16T00:52:11.590Z] Jul 16, 2025 12:38:26 AM com.sun.java.util.jar.pack.Utils$Pack200Logger info
[2025-07-16T00:52:11.590Z] INFO: Have read 4000 files...
[2025-07-16T00:52:11.590Z] Jul 16, 2025 12:38:34 AM com.sun.java.util.jar.pack.Utils$Pack200Logger info
[2025-07-16T00:52:11.590Z] INFO: Have read 5000 files...
[2025-07-16T00:52:11.590Z] Jul 16, 2025 12:38:39 AM com.sun.java.util.jar.pack.Utils$Pack200Logger info
[2025-07-16T00:52:11.590Z] INFO: Have read 6000 files...
[2025-07-16T00:52:11.590Z] Jul 16, 2025 12:38:46 AM com.sun.java.util.jar.pack.Utils$Pack200Logger info
[2025-07-16T00:52:11.591Z] INFO: Have read 7000 files...
[2025-07-16T00:52:11.591Z] Jul 16, 2025 12:38:52 AM com.sun.java.util.jar.pack.Utils$Pack200Logger info
[2025-07-16T00:52:11.591Z] INFO: Have read 8000 files...
[2025-07-16T00:52:11.591Z] Jul 16, 2025 12:38:57 AM com.sun.java.util.jar.pack.Utils$Pack200Logger info
[2025-07-16T00:52:11.591Z] INFO: Have read 9000 files...
[2025-07-16T00:52:11.591Z] Jul 16, 2025 12:39:03 AM com.sun.java.util.jar.pack.Utils$Pack200Logger info
[2025-07-16T00:52:11.591Z] INFO: Have read 10000 files...
[2025-07-16T00:52:11.591Z] Jul 16, 2025 12:39:11 AM com.sun.java.util.jar.pack.Utils$Pack200Logger info
[2025-07-16T00:52:11.591Z] INFO: Have read 11000 files...
[2025-07-16T00:52:11.591Z] Jul 16, 2025 12:39:18 AM com.sun.java.util.jar.pack.Utils$Pack200Logger info
[2025-07-16T00:52:11.591Z] INFO: Have read 12000 files...
[2025-07-16T00:52:11.591Z] Jul 16, 2025 12:39:26 AM com.sun.java.util.jar.pack.Utils$Pack200Logger info
[2025-07-16T00:52:11.591Z] INFO: Have read 13000 files...
[2025-07-16T00:52:11.591Z] Jul 16, 2025 12:39:32 AM com.sun.java.util.jar.pack.Utils$Pack200Logger info
[2025-07-16T00:52:11.591Z] INFO: Have read 14000 files...
[2025-07-16T00:52:11.591Z] Jul 16, 2025 12:39:39 AM com.sun.java.util.jar.pack.Utils$Pack200Logger info
[2025-07-16T00:52:11.591Z] INFO: Have read 15000 files...
[2025-07-16T00:52:11.591Z] Jul 16, 2025 12:39:44 AM com.sun.java.util.jar.pack.Utils$Pack200Logger info
[2025-07-16T00:52:11.591Z] INFO: Have read 16000 files...
[2025-07-16T00:52:11.591Z] Jul 16, 2025 12:39:48 AM com.sun.java.util.jar.pack.Utils$Pack200Logger info
[2025-07-16T00:52:11.591Z] INFO: Have read 17000 files...
[2025-07-16T00:52:11.591Z] Jul 16, 2025 12:39:54 AM com.sun.java.util.jar.pack.Utils$Pack200Logger info
[2025-07-16T00:52:11.591Z] INFO: Have read 18000 files...
[2025-07-16T00:52:11.591Z] Jul 16, 2025 12:39:58 AM com.sun.java.util.jar.pack.Utils$Pack200Logger info
[2025-07-16T00:52:11.591Z] INFO: Have read 19000 files...
[2025-07-16T00:52:11.591Z] Jul 16, 2025 12:40:03 AM com.sun.java.util.jar.pack.Utils$Pack200Logger info
[2025-07-16T00:52:11.591Z] INFO: Have read 20000 files...
[2025-07-16T00:52:11.591Z] Jul 16, 2025 12:40:09 AM com.sun.java.util.jar.pack.Utils$Pack200Logger info
[2025-07-16T00:52:11.591Z] INFO: Have read 21000 files...
[2025-07-16T00:52:11.591Z] Jul 16, 2025 12:40:14 AM com.sun.java.util.jar.pack.Utils$Pack200Logger info
[2025-07-16T00:52:11.591Z] INFO: Have read 22000 files...
[2025-07-16T00:52:11.591Z] Jul 16, 2025 12:40:19 AM com.sun.java.util.jar.pack.Utils$Pack200Logger info
[2025-07-16T00:52:11.591Z] INFO: Have read 23000 files...
[2025-07-16T00:52:11.591Z] Jul 16, 2025 12:40:25 AM com.sun.java.util.jar.pack.Utils$Pack200Logger info
[2025-07-16T00:52:11.591Z] INFO: Have read 24000 files...
[2025-07-16T00:52:11.591Z] Jul 16, 2025 12:40:31 AM com.sun.java.util.jar.pack.Utils$Pack200Logger info
[2025-07-16T00:52:11.591Z] INFO: Have read 25000 files...
[2025-07-16T00:52:11.591Z] Jul 16, 2025 12:40:37 AM com.sun.java.util.jar.pack.Utils$Pack200Logger info
[2025-07-16T00:52:11.591Z] INFO: Have read 26000 files...
[2025-07-16T00:52:11.591Z] Jul 16, 2025 12:40:44 AM com.sun.java.util.jar.pack.Utils$Pack200Logger info
[2025-07-16T00:52:11.591Z] INFO: Have read 27000 files...
[2025-07-16T00:52:11.591Z] Jul 16, 2025 12:40:50 AM com.sun.java.util.jar.pack.Utils$Pack200Logger info
[2025-07-16T00:52:11.591Z] INFO: Have read 28000 files...
[2025-07-16T00:52:11.591Z] Jul 16, 2025 12:40:56 AM com.sun.java.util.jar.pack.Utils$Pack200Logger info
[2025-07-16T00:52:11.591Z] INFO: Have read 29000 files...
[2025-07-16T00:52:11.591Z] Jul 16, 2025 12:41:03 AM com.sun.java.util.jar.pack.Utils$Pack200Logger info
[2025-07-16T00:52:11.591Z] INFO: Have read 30000 files...
[2025-07-16T00:52:11.591Z] Jul 16, 2025 12:41:09 AM com.sun.java.util.jar.pack.Utils$Pack200Logger info
[2025-07-16T00:52:11.591Z] INFO: Have read 31000 files...
[2025-07-16T00:52:11.591Z] Jul 16, 2025 12:41:36 AM com.sun.java.util.jar.pack.Utils$Pack200Logger info
[2025-07-16T00:52:11.591Z] INFO: Have read 32000 files...
[2025-07-16T00:52:11.591Z] Jul 16, 2025 12:41:36 AM com.sun.java.util.jar.pack.Utils$Pack200Logger info
[2025-07-16T00:52:11.591Z] INFO: Transmitting 32095 files, including per-file data for 30522 classes out of 30522
[2025-07-16T00:52:11.591Z] Jul 16, 2025 12:41:36 AM com.sun.java.util.jar.pack.Utils$Pack200Logger info
[2025-07-16T00:52:11.591Z] INFO: Setting up constant pool...
[2025-07-16T00:52:11.591Z] Jul 16, 2025 12:41:37 AM com.sun.java.util.jar.pack.Utils$Pack200Logger info
[2025-07-16T00:52:11.591Z] INFO: Consensus version number in segment is 55.0
[2025-07-16T00:52:11.591Z] Jul 16, 2025 12:41:37 AM com.sun.java.util.jar.pack.Utils$Pack200Logger info
[2025-07-16T00:52:11.591Z] INFO: Highest version number in segment is 55.0
[2025-07-16T00:52:11.591Z] Jul 16, 2025 12:41:38 AM com.sun.java.util.jar.pack.Utils$Pack200Logger info
[2025-07-16T00:52:11.591Z] INFO: archiveOptions = 0b11000100
[2025-07-16T00:52:11.591Z] Fixing new attribute at 2: class.NestHost[RCH]
[2025-07-16T00:52:11.591Z] Jul 16, 2025 12:41:43 AM com.sun.java.util.jar.pack.Utils$Pack200Logger info
[2025-07-16T00:52:11.591Z] INFO: Using free flag bit 1<<2 for 13240 occurrences of class.NestHost[RCH]
[2025-07-16T00:52:11.591Z] Fixing new attribute at 3: class.NestMembers[NH[RCH]]
[2025-07-16T00:52:11.591Z] Jul 16, 2025 12:41:43 AM com.sun.java.util.jar.pack.Utils$Pack200Logger info
[2025-07-16T00:52:11.591Z] INFO: Using free flag bit 1<<3 for 3692 occurrences of class.NestMembers[NH[RCH]]
[2025-07-16T00:52:11.591Z] Fixing new attribute at 5: field.Synthetic[]
[2025-07-16T00:52:11.591Z] Jul 16, 2025 12:41:43 AM com.sun.java.util.jar.pack.Utils$Pack200Logger info
[2025-07-16T00:52:11.591Z] INFO: Using free flag bit 1<<5 for 23 occurrences of field.Synthetic[]
[2025-07-16T00:52:11.591Z] Fixing new attribute at 9: method.Synthetic[]
[2025-07-16T00:52:11.591Z] Jul 16, 2025 12:41:43 AM com.sun.java.util.jar.pack.Utils$Pack200Logger info
[2025-07-16T00:52:11.591Z] INFO: Using free flag bit 1<<9 for 5 occurrences of method.Synthetic[]
[2025-07-16T00:52:11.591Z]
[2025-07-16T00:52:11.591Z] TEST RESULT: Error. Agent error: java.lang.Exception: Agent 7 timed out with a timeout of 960 seconds; check console log for any additional details
[2025-07-16T00:52:11.591Z] --------------------------------------------------
[2025-07-16T00:57:08.639Z] Test results: passed: 18; error: 1
[2025-07-16T00:57:51.138Z] Report written to /home/jenkins/workspace/Test_openjdk11_hs_sanity.openjdk_x86-64_alpine-linux_testList_2/aqa-tests/TKG/output_17526115725647/jdk11_tier1_pack200_1/report/html/report.html
[2025-07-16T00:57:51.138Z] Results written to /home/jenkins/workspace/Test_openjdk11_hs_sanity.openjdk_x86-64_alpine-linux_testList_2/aqa-tests/TKG/output_17526115725647/jdk11_tier1_pack200_1/work
[2025-07-16T00:57:51.138Z] Error: Some tests failed or other problems occurred.
[2025-07-16T00:57:51.138Z] -----------------------------------
[2025-07-16T00:57:51.138Z] jdk11_tier1_pack200_1_FAILED
[2025-07-16T00:57:51.138Z] -----------------------------------
[2025-07-16T00:57:51.138Z]
[2025-07-16T00:57:51.138Z] TEST TEARDOWN:
[2025-07-16T00:57:51.138Z] Nothing to be done for teardown.
[2025-07-16T00:57:51.138Z] jdk11_tier1_pack200_1 Finish Time: Wed Jul 16 00:57:50 2025 Epoch Time (ms): 1752627470497