ssl-tests_0
[2025-08-01T22:46:52.955Z] Running test ssl-tests_0 ...
[2025-08-01T22:46:52.955Z] ===============================================
[2025-08-01T22:46:52.955Z] ssl-tests_0 Start Time: Fri Aug 1 22:46:52 2025 Epoch Time (ms): 1754088412853
[2025-08-01T22:46:53.307Z] variation: NoOptions
[2025-08-01T22:46:53.307Z] JVM_OPTIONS:
[2025-08-01T22:46:53.307Z] { \
[2025-08-01T22:46:53.307Z] echo ""; echo "TEST SETUP:"; \
[2025-08-01T22:46:53.307Z] echo "Nothing to be done for setup."; \
[2025-08-01T22:46:53.307Z] mkdir -p "C:/jenkins/workspace/Test_openjdk11_hs_dev.functional_x86-64_windows/aqa-tests/\\TKG\\output_17540884103264\\ssl-tests_0"; \
[2025-08-01T22:46:53.307Z] cd "C:/jenkins/workspace/Test_openjdk11_hs_dev.functional_x86-64_windows/aqa-tests/\\TKG\\output_17540884103264\\ssl-tests_0"; \
[2025-08-01T22:46:53.307Z] echo ""; echo "TESTING:"; \
[2025-08-01T22:46:53.307Z] JTREG_HOME="C:/jenkins/workspace/Test_openjdk11_hs_dev.functional_x86-64_windows/aqa-tests///..//jvmtest\\functional\\security\\ssl-tests\\jtreg" \
[2025-08-01T22:46:53.307Z] C:/jenkins/workspace/Test_openjdk11_hs_dev.functional_x86-64_windows/aqa-tests/\\functional\\security\\ssl-tests\\ssl-tests\\run.sh "c:/jenkins/workspace/Test_openjdk11_hs_dev.functional_x86-64_windows/jdkbinary/j2sdk-image" ; if [ $? -eq 0 ]; then echo "-----------------------------------"; echo "ssl-tests_0""_PASSED"; echo "-----------------------------------"; cd C:/jenkins/workspace/Test_openjdk11_hs_dev.functional_x86-64_windows/aqa-tests/; else echo "-----------------------------------"; echo "ssl-tests_0""_FAILED"; echo "-----------------------------------"; fi; \
[2025-08-01T22:46:53.307Z] echo ""; echo "TEST TEARDOWN:"; \
[2025-08-01T22:46:53.307Z] echo "Nothing to be done for teardown."; \
[2025-08-01T22:46:53.307Z] } 2>&1 | tee -a "C:/jenkins/workspace/Test_openjdk11_hs_dev.functional_x86-64_windows/aqa-tests/\\TKG\\output_17540884103264\\TestTargetResult";
[2025-08-01T22:46:53.307Z]
[2025-08-01T22:46:53.307Z] TEST SETUP:
[2025-08-01T22:46:53.307Z] Nothing to be done for setup.
[2025-08-01T22:46:53.307Z]
[2025-08-01T22:46:53.307Z] TESTING:
[2025-08-01T22:46:53.307Z] /cygdrive/c/jenkins/workspace/Test_openjdk11_hs_dev.functional_x86-64_windows/aqa-tests/functional/security/ssl-tests/ssl-tests /cygdrive/c/jenkins/workspace/Test_openjdk11_hs_dev.functional_x86-64_windows/aqa-tests/TKG/output_17540884103264/ssl-tests_0
[2025-08-01T22:46:53.659Z] /cygdrive/c/jenkins/workspace/Test_openjdk11_hs_dev.functional_x86-64_windows/aqa-tests/functional/security/ssl-tests/ssl-tests
[2025-08-01T22:46:55.995Z] treating jdk as: 11
[2025-08-01T22:46:55.995Z] Running with C:\jenkins\workspace\Test_openjdk11_hs_dev.functional_x86-64_windows\jdkbinary\j2sdk-image...
[2025-08-01T22:46:59.014Z] XML output to C:\Jenkins\workspace\Test_openjdk11_hs_dev.functional_x86-64_windows\aqa-tests\functional\security\ssl-tests\ssl-tests\test.1754088413\jdk\work
[2025-08-01T22:46:59.757Z] FAILED: ssl-tests.sh
[2025-08-01T22:46:59.757Z] FAILED: ssl-tests-bc-2nd.sh
[2025-08-01T22:46:59.757Z] FAILED: ssl-tests-bcfips.sh
[2025-08-01T22:46:59.757Z] FAILED: ssl-tests-bcjsse.sh
[2025-08-01T22:46:59.757Z] Test results: failed: 4
[2025-08-01T22:47:00.110Z] Error: Some tests failed or other problems occurred.
[2025-08-01T22:47:00.110Z] Report written to C:\Jenkins\workspace\Test_openjdk11_hs_dev.functional_x86-64_windows\aqa-tests\functional\security\ssl-tests\ssl-tests\test.1754088413\jdk\report\html\report.html
[2025-08-01T22:47:00.110Z] Results written to C:\Jenkins\workspace\Test_openjdk11_hs_dev.functional_x86-64_windows\aqa-tests\functional\security\ssl-tests\ssl-tests\test.1754088413\jdk\work
[2025-08-01T22:47:00.887Z] /cygdrive/c/jenkins/workspace/Test_openjdk11_hs_dev.functional_x86-64_windows/aqa-tests/TKG/output_17540884103264/ssl-tests_0
[2025-08-01T22:47:00.887Z] renamed '/cygdrive/c/jenkins/workspace/Test_openjdk11_hs_dev.functional_x86-64_windows/aqa-tests/functional/security/ssl-tests/ssl-tests/test.1754088413.tar.gz' -> './test.1754088413.tar.gz'
[2025-08-01T22:47:00.887Z] -----------------------------------
[2025-08-01T22:47:00.887Z] ssl-tests_0_FAILED
[2025-08-01T22:47:00.887Z] -----------------------------------
[2025-08-01T22:47:00.887Z]
[2025-08-01T22:47:00.887Z] TEST TEARDOWN:
[2025-08-01T22:47:00.887Z] Nothing to be done for teardown.
[2025-08-01T22:47:00.887Z] ssl-tests_0 Finish Time: Fri Aug 1 22:47:00 2025 Epoch Time (ms): 1754088420657